program: Gaussian 09
title: 000233666
version: EM64L-G09RevD.01
frameworkgroup: C1[X(C21H28N2)]
method: RPBEPBE
basis: SDD
operation: Freq
keyword: #pfreq=noraman
keyword: PBEPBE/SDD
title: #p freq=noraman PBEPBE/SDD
converged: YES YES NO NO
title: Mulliken charges:
elementType: N N C C C C C C C C C C C C C C C C C C C C C H H H H H H H H H H H H H H H H H H H H H H H H H H H H
charge: -0.122464 -0.397072 0.028961 -0.415845 -0.448588 -0.405853 -0.412656 -0.385729 -0.374495 -0.531525 -0.465723 0.010383 0.328479 0.171769 -0.596035 -0.405710 0.437637 -0.350718 -0.245097 -0.488654 -0.429098 -0.278144 -0.245363 0.187082 0.200106 0.191322 0.215839 0.203672 0.191322 0.196607 0.197828 0.194662 0.190680 0.197631 0.239837 0.210312 0.238793 0.214149 0.224999 0.248769 0.214428 0.286090 0.216386 0.209968 0.223915 0.189765 0.217950 0.234373 0.235596 0.223809 0.225655
chargesum: 0.00000
title: Mulliken charges with hydrogens summed into heavy atoms:
elementType: N N C C C C C C C C C C C C C C C C C C C C C
charge: -0.122464 -0.110983 0.216043 -0.024418 -0.029076 -0.017924 -0.020167 0.002582 0.075654 -0.078583 0.008045 0.224810 0.328479 0.171769 -0.169682 -0.181795 0.437637 -0.160953 -0.027148 -0.254281 -0.193502 -0.054335 -0.019709
polarizability: 3.30923896e+02 1.36585656e+01 2.60555496e+02 -2.18662855e+01 -1.54487335e+01 1.55709764e+02
1716.lowfreq: -5.3264 -2.5386 -0.0005 -0.0004 0.0009 7.1834 14.7557 17.7915 23.6870
frequency: 14.6610 17.7239 23.4010 44.4709 64.3896 70.8804 77.7957 97.1998 102.4019 153.4888 174.0593 184.7680 220.9160 232.3241 240.2508 252.8392 283.6683 309.8702 329.2593 337.5887 359.7590 378.7778 388.6471 423.8580 428.6914 436.8554 451.6943 475.0029 481.1248 486.9483 508.9731 530.4460 567.5832 574.3832 612.6371 647.4332 652.9764 705.8779 728.6559 767.0266 772.5508 778.8768 784.5325 787.1212 793.0253 836.4066 846.8950 854.0256 859.2658 873.6233 885.5583 892.4509 901.1831 922.3286 930.0124 941.4177 944.4565 963.1602 983.9598 985.5023 994.5851 1002.8249 1019.5595 1037.1072 1041.3756 1050.6707 1059.2299 1076.8137 1079.9815 1089.7911 1113.5719 1118.6280 1142.7934 1146.4333 1151.8409 1166.8589 1179.0368 1191.7736 1193.5260 1231.2186 1237.5579 1246.7737 1255.1432 1260.5474 1265.8606 1280.7812 1284.1452 1292.5223 1306.0170 1313.9125 1321.9611 1325.3769 1327.5111 1332.0116 1340.3815 1340.7383 1342.6124 1357.5840 1361.3400 1374.6707 1410.9139 1416.2055 1424.9452 1446.4126 1451.7554 1454.9322 1461.0198 1462.8790 1464.6685 1470.5373 1472.6699 1481.2963 1489.0944 1492.4442 1541.9912 1592.4143 1596.7505 1629.8679 1649.3624 2829.8463 2960.1122 2965.8261 2967.4930 2968.1671 2970.6817 2972.9823 2976.7644 3000.0076 3015.0007 3027.1123 3027.9766 3035.3037 3041.4733 3047.2480 3055.0332 3067.3025 3074.6116 3087.8800 3107.8690 3120.2829 3123.1657 3138.5969 3144.6076 3159.5614 3162.2107 3186.4410 3597.9636
redmass: 4.3681 4.3250 4.4623 3.3971 3.8381 3.5724 3.6881 3.1829 2.3587 3.1218 3.6600 3.5066 2.0808 2.4085 3.0147 2.9621 2.0369 1.7861 2.0601 2.4614 2.9473 2.8428 2.5546 2.5397 3.1015 3.8289 2.6213 3.3500 3.4081 2.1436 2.7909 2.4516 3.1076 3.3270 3.6367 3.0508 2.1670 3.3839 1.3193 1.9996 1.5414 2.6426 2.1684 1.4372 1.9220 3.3278 1.5706 3.0216 2.1237 1.6773 1.7531 1.4595 2.0951 1.9122 1.8302 1.3853 1.4838 1.3288 1.3508 2.1014 5.0487 1.2231 4.3529 2.3245 2.2278 1.2296 1.8666 1.5948 2.0301 1.9453 2.3746 2.0319 2.0624 2.1287 1.5187 2.1605 1.1040 1.2620 1.5280 1.6974 1.5068 1.4306 1.2913 1.2077 1.5956 1.2090 1.3044 1.2647 1.3258 1.3934 1.4040 1.4384 1.3564 1.4567 1.4770 1.4552 1.4714 1.9506 1.3547 1.3892 3.9155 3.0564 1.1838 2.5662 2.0697 1.0932 1.0852 1.0917 1.0862 1.0892 1.1200 1.0939 2.0573 1.1353 2.8801 5.2671 6.8765 6.0460 4.5366 1.0803 1.0589 1.0608 1.0609 1.0659 1.0616 1.0656 1.0632 1.0624 1.1012 1.0969 1.0965 1.1007 1.1019 1.0961 1.0984 1.1033 1.0645 1.0895 1.0858 1.0872 1.0855 1.0938 1.0929 1.1000 1.0969 1.1140 1.0760
irintensity: 0.1428 0.0936 0.0381 0.1101 0.0306 0.0940 0.8189 1.6605 0.1739 0.4476 0.5040 1.2476 0.1887 0.5856 1.2387 2.7658 12.3065 0.9668 20.0391 30.5665 1.4898 1.5564 27.1533 21.1907 2.9846 5.1079 3.0360 0.0242 0.6941 2.2978 2.1126 2.8970 10.0674 14.3923 3.7972 3.7695 9.2980 12.6752 1.9522 3.0297 125.9652 3.0998 6.1597 0.2130 29.8281 0.9077 7.1024 2.3752 13.7108 7.7885 4.6534 8.9831 6.2352 3.1820 13.7172 2.2286 72.1108 1.9133 1.1243 1.2462 3.3407 12.9495 2.3701 4.9476 15.6406 1.4203 0.9791 20.9123 41.8174 21.6658 4.0474 33.2122 8.3262 10.3552 6.3313 28.9106 1.2635 3.6160 0.3549 2.3456 2.2446 6.8800 6.0917 2.2544 5.6102 0.1210 4.0352 42.0544 18.8147 12.8044 9.5977 1.3223 9.6326 5.2163 2.6193 1.1427 2.9886 6.8184 2.1548 32.4031 2.7236 83.3794 9.7382 60.2673 2.5340 23.1182 3.0588 11.8719 10.1713 18.8027 7.4145 4.0316 54.1858 23.9164 172.7759 84.1211 132.8024 7.2771 8.3631 64.9164 31.7252 34.8033 38.1913 52.9021 16.4622 12.3992 46.1874 51.2628 19.3353 69.9228 86.2673 6.1030 62.2081 52.6326 46.0577 33.4353 35.1945 7.6290 14.5622 1.8241 3.5714 28.4480 43.1474 58.2814 12.7259 27.8907 18.9402
temp: 298.150 k
press: 1.00000 atm
elementType: 7 7 6 6 6 6 6 6 6 6 6 6 6 6 6 6 6 6 6 6 6 6 6 1 1 1 1 1 1 1 1 1 1 1 1 1 1 1 1 1 1 1 1 1 1 1 1 1 1 1 1
symmnumber: 1
zpe: 1159614.5 jmol-1
zpe.correction: 0.441674 hartree
zpe.thermalcorrener: 0.463722 hartree
zpe.thermalcorrenthalpy: 0.464666 hartree
zpe.thermalcorrgfe: 0.387944 hartree
zpe.sumelectzpe: -924.786780 hartree
zpe.sumelectthermal: -924.764732 hartree
zpe.sumelectthermalent: -924.763788 hartree
zpe.sumelectthermalfe: -924.840510 hartree
dipole: 2.2635 -1.2165 0.6485
dipole: 2.6502
quadrupole: -137.1116 -131.1069 -144.1934
quadrupole: 1.8596 -3.5960 -2.6801
quadrupole: 0.3590 6.3637 -6.7227 1.8596 -3.5960 -2.6801
hfenergy: -925.2284543 hartree
pointgroup: C01 [X(C21H28N2)]
dipole: 0.9051095 0.4976267 -0.1425396 debye
polarizability: 330.018967|-20.4464412|263.0004395|16.8544108|9.9426505|154.169749 unknown
InChI: InChI=1S/C21H28N2/c1-2-16-23(19-11-4-3-5-12-19)17-15-22-21-14-8-10-18-9-6-7-13-20(18)21/h2,6-10,13-14,19,22H,1,3-5,11-12,15-17H2
charge 0 multiplicity 1
51 atoms
N  2.444567 -0.645665 0.168462
N  -1.048053 0.795447 0.792259
C  3.621139 0.218836 -0.16455
C  3.50048 1.588639 0.556192
C  4.959255 -0.450451 0.240542
C  4.703912 2.513345 0.256076
C  6.172479 0.467038 -0.049178
C  6.037872 1.838956 0.647615
C  1.118998 -0.073862 -0.181526
C  2.555936 -2.094237 -0.15974
C  0.304372 0.313064 1.088819
C  2.70646 -2.409742 -1.645156
C  -2.144213 -0.022806 0.514839
C  -3.430509 0.580958 0.181903
C  3.670335 -3.201032 -2.179083
C  -2.045491 -1.431476 0.562499
C  -4.565739 -0.282464 -0.081392
C  -3.6250 1.999085 0.101373
C  -3.175829 -2.256918 0.30377
C  -4.418749 -1.706978 -0.013716
C  -5.829777 0.313658 -0.407798
C  -4.869358 2.551719 -0.219992
C  -5.986101 1.699104 -0.477494
H  3.665867 0.41752 -1.268128
H  3.438194 1.394368 1.646536
H  2.565743 2.10267 0.261287
H  5.095858 -1.400106 -0.307194
H  4.917288 -0.689997 1.323137
H  4.721814 2.756366 -0.826889
H  4.580885 3.472204 0.796081
H  7.102701 -0.040148 0.272334
H  6.256819 0.622671 -1.144836
H  6.066232 1.697012 1.747737
H  6.893105 2.490743 0.383364
H  0.520474 -0.802637 -0.763006
H  1.222423 0.818527 -0.831703
H  3.391448 -2.544127 0.40426
H  1.63414 -2.578248 0.222493
H  0.261584 -0.561281 1.765304
H  0.848203 1.10203 1.637342
H  1.964221 -1.943007 -2.312201
H  -1.178182 1.802411 0.738712
H  3.728127 -3.398532 -3.255691
H  4.428848 -3.685809 -1.549703
H  -1.091951 -1.908117 0.807851
H  -2.796182 2.692638 0.290446
H  -3.054394 -3.345046 0.35644
H  -5.285285 -2.346344 -0.214277
H  -6.681252 -0.349216 -0.604042
H  -4.988408 3.639365 -0.274787
H  -6.959207 2.135468 -0.728494
