program: Gaussian 09
title: 000233648
version: EM64L-G09RevD.01
frameworkgroup: C1[X(C11H23NO)]
method: RPBEPBE
basis: SDD
operation: Freq
keyword: #p
keyword: freq=noraman
keyword: PBEPBE/SDD
title: #p freq=noraman PBEPBE/SDD
converged: YES YES NO NO
title: Mulliken charges:
elementType: O N C C C C C C C C C C C H H H H H H H H H H H H H H H H H H H H H H H
charge: -0.298185 -0.141921 -0.036018 -0.534285 -0.354678 -0.370065 0.255198 -0.349686 -0.348291 -0.715794 -0.716592 -0.683707 -0.675690 0.183417 0.225807 0.225006 0.192175 0.250513 0.212288 0.225923 0.187265 0.239603 0.205640 0.209811 0.262375 0.203290 0.193911 0.193914 0.267780 0.201250 0.203273 0.220297 0.219729 0.210168 0.225188 0.211090
chargesum: 0.00000
title: Mulliken charges with hydrogens summed into heavy atoms:
elementType: O N C C C C C C C C C C C
charge: -0.298185 -0.141921 0.147399 -0.083472 0.088009 0.068146 0.255198 0.077182 0.067161 -0.056217 -0.053647 -0.040408 -0.029244
polarizability: 1.49955213e+02 -3.87776530e+00 1.35049119e+02 5.09613188e-01 -2.11127075e+00 1.07220129e+02
1716.lowfreq: -7.2974 -0.0004 -0.0001 0.0002 6.6028 10.3094 34.8888 45.4906 53.0846
frequency: 34.0108 45.4385 52.9322 62.3462 87.9268 94.1759 102.2004 142.8075 175.4456 213.3472 217.7983 220.7369 233.9003 238.9815 248.2477 288.6981 315.2296 354.1239 357.6584 381.8153 424.5077 445.9976 544.8139 589.3204 650.5800 741.8104 746.6419 779.3457 803.1783 861.9023 867.5768 885.8016 890.4456 892.0528 922.0000 954.3699 962.0634 1004.4479 1044.9607 1053.6283 1092.5707 1095.6530 1103.3200 1108.2643 1111.0213 1140.8242 1200.6897 1208.6584 1222.8472 1243.2295 1262.6639 1287.0537 1295.4814 1297.2553 1300.9366 1308.6478 1332.4012 1352.7188 1357.5036 1364.1165 1368.1183 1385.1870 1388.6478 1395.3274 1410.6295 1437.5991 1450.7118 1459.6762 1473.1659 1473.3982 1475.3351 1478.8893 1479.5235 1480.2758 1484.1705 1486.0237 1491.7788 1499.5695 1580.2185 2943.1503 2960.1804 2970.4265 2973.9948 2975.9013 2976.5609 2980.7548 2982.9290 2991.4522 2994.4594 3010.7585 3030.6185 3040.6591 3055.7040 3059.7975 3060.9204 3065.2032 3074.8148 3076.9781 3080.4894 3081.0720 3096.9792 3102.0650
redmass: 3.3656 3.2149 3.2306 2.9969 1.6428 2.3485 2.1686 2.5335 2.9322 1.1760 1.3369 1.1527 1.1199 1.9377 2.7994 2.8257 2.9733 1.9262 2.9783 2.2847 3.5174 3.1352 3.1526 3.5415 3.3282 1.1122 1.1193 4.0168 2.7204 1.4358 1.2698 1.7088 1.6337 1.6928 1.2600 2.4604 1.5741 2.0902 2.9620 2.8461 1.6854 1.4388 2.0342 1.8957 2.2215 1.9904 1.9304 2.5429 1.5293 1.1829 1.4074 1.2652 1.4679 1.3468 1.3788 1.3019 1.4734 1.3723 1.3324 1.3773 1.2322 1.2252 1.2087 1.2098 2.2085 1.1063 1.1306 1.0429 1.0595 1.0707 1.0576 1.0464 1.0530 1.0750 1.0533 1.0743 1.1031 1.0588 5.6455 1.0740 1.0646 1.0369 1.0360 1.0366 1.0425 1.0623 1.0627 1.0629 1.0638 1.0981 1.0981 1.0949 1.0991 1.0991 1.0978 1.0999 1.1016 1.0993 1.0991 1.1028 1.0989 1.0985
irintensity: 0.5311 0.3363 1.2572 0.2411 0.0663 0.0248 0.1459 3.3339 3.6197 0.2541 0.3152 0.4847 0.2413 0.3111 0.3488 0.9661 0.6756 0.1617 13.4736 0.9396 9.9619 1.1638 1.7996 6.0013 7.0423 5.8673 16.5993 1.4495 3.7892 0.2603 1.8770 27.9207 5.0810 2.0032 1.8451 5.7604 0.2106 9.6361 0.6182 0.5913 17.7309 52.8338 1.3293 6.7719 2.5542 58.2077 1.7848 18.6490 42.2741 1.9572 9.9732 4.6770 14.5698 0.9415 12.8264 24.4228 1.7660 4.9761 2.3306 7.8412 29.8777 61.4096 12.1971 13.1751 81.6624 27.8793 18.3177 1.4756 1.8988 5.7378 31.5254 9.4851 7.2698 6.0830 1.0580 16.5505 18.1070 25.8619 214.3748 24.0658 46.3123 62.5519 43.3768 33.4738 30.0163 7.3494 10.6878 73.6310 37.0880 22.9142 4.6199 2.3489 21.7450 2.0318 87.7915 15.0949 81.8234 44.1364 41.0735 62.6974 3.3035 30.3353
temp: 298.150 k
press: 1.00000 atm
elementType: 8 7 6 6 6 6 6 6 6 6 6 6 6 1 1 1 1 1 1 1 1 1 1 1 1 1 1 1 1 1 1 1 1 1 1 1
symmnumber: 1
zpe: 848769.8 jmol-1
zpe.correction: 0.323279 hartree
zpe.thermalcorrener: 0.340282 hartree
zpe.thermalcorrenthalpy: 0.341226 hartree
zpe.thermalcorrgfe: 0.277920 hartree
zpe.sumelectzpe: -561.870511 hartree
zpe.sumelectthermal: -561.853508 hartree
zpe.sumelectthermalent: -561.852564 hartree
zpe.sumelectthermalfe: -561.915871 hartree
dipole: -2.4122 3.1448 -1.3108
dipole: 4.1745
quadrupole: -80.8714 -84.4979 -83.7363
quadrupole: 2.7979 -1.6890 0.9767
quadrupole: 2.1638 -1.4627 -0.7011 2.7979 -1.6890 0.9767
hfenergy: -562.1937903 hartree
pointgroup: C01 [X(C11H23N1O1)]
dipole: -0.8736189 1.3010479 -0.4913358 debye
polarizability: 149.4284615|-4.769783|135.6391781|0.1357589|-1.6613767|107.1568217 unknown
InChI: InChI=1S/C11H23NO/c1-5-7-12(8-6-2)11(13)9-10(3)4/h10H,5-9H2,1-4H3
charge 0 multiplicity 1
36 atoms
O  0.777862 -1.545815 0.55823
N  -0.781016 0.072231 -0.003098
C  3.089775 0.044054 -0.297502
C  1.62629 0.515289 -0.521986
C  -1.859549 -0.794949 0.530886
C  -1.183427 1.380809 -0.56098
C  0.530277 -0.400719 0.054989
C  -2.430029 -1.763427 -0.53196
C  -1.311961 2.49763 0.506055
C  3.451193 -0.053961 1.204467
C  3.409811 -1.273071 -1.045678
C  -3.572583 -2.630888 0.03745
C  -1.8113 3.8239 -0.105577
H  3.723292 0.842361 -0.742635
H  1.452973 0.618444 -1.614331
H  1.508901 1.531652 -0.094156
H  -2.664887 -0.145669 0.926485
H  -1.441525 -1.38116 1.367665
H  -2.159598 1.250597 -1.069301
H  -0.466326 1.694639 -1.339315
H  -2.794979 -1.18478 -1.404511
H  -1.606017 -2.40774 -0.889714
H  -2.00659 2.161884 1.300439
H  -0.329191 2.648579 0.993282
H  2.862277 -0.851854 1.686619
H  4.525227 -0.287636 1.328864
H  3.250002 0.898745 1.732114
H  3.176728 -1.188678 -2.125017
H  2.81729 -2.10224 -0.625834
H  4.483823 -1.520218 -0.950702
H  -4.416865 -2.007374 0.389278
H  -3.963871 -3.326569 -0.726609
H  -3.219828 -3.235699 0.893577
H  -2.808014 3.700211 -0.570025
H  -1.894791 4.611706 0.664147
H  -1.119775 4.190317 -0.887816
