program: Gaussian 09
title: 000233639
version: EM64L-G09RevD.01
frameworkgroup: C1[X(C9H18O3)]
method: RPBEPBE
basis: SDD
operation: Freq
keyword: #pfreq=noraman
keyword: PBEPBE/SDD
title: #p freq=noraman PBEPBE/SDD
converged: NO YES NO NO
title: Mulliken charges:
elementType: O O O C C C C C C C C C H H H H H H H H H H H H H H H H H H
charge: -0.253281 -0.299883 -0.278465 -0.428967 -0.004382 -0.403417 -0.383921 -0.327133 0.067494 -0.289232 -0.718484 -0.497718 0.213456 0.201219 0.201660 0.223628 0.209290 0.200510 0.195702 0.205428 0.251553 0.238211 0.201959 0.181570 0.227353 0.210850 0.219859 0.231256 0.199885 0.204000
chargesum: 0.00000
title: Mulliken charges with hydrogens summed into heavy atoms:
elementType: O O O C C C C C C C C C
charge: -0.253281 -0.299883 -0.278465 -0.014293 0.197278 0.029501 0.012292 0.129848 0.305705 0.094298 -0.060423 0.137422
polarizability: 1.15735804e+02 2.89390868e+00 1.12411767e+02 5.47246553e-01 -1.58333961e+00 9.02322813e+01
1716.lowfreq: -12.7812 -0.0005 0.0003 0.0006 4.6475 15.9282 39.7708 51.1622 78.5109
frequency: 39.1515 51.1573 78.4893 104.5660 118.7215 154.7397 178.4192 205.4360 225.0654 238.3452 266.7952 317.4406 343.1038 388.8519 408.1297 451.5257 476.2304 507.9694 552.0494 655.5646 768.5810 777.9136 829.0393 847.5060 870.9959 875.4695 900.8297 923.9634 937.1750 943.5924 1006.1441 1020.5825 1052.8592 1063.8025 1072.7905 1102.5913 1107.5163 1115.3768 1122.1637 1140.7751 1174.3202 1176.1872 1183.5701 1225.8097 1255.9222 1272.5148 1296.1680 1306.6083 1325.6745 1340.4542 1341.6820 1350.9784 1354.8692 1373.0096 1381.7181 1387.1293 1435.4300 1445.6347 1453.9288 1456.9423 1457.6996 1462.6606 1466.6924 1474.4974 1479.4128 1480.3323 2918.2830 2927.4866 2976.7427 2977.7268 2981.4945 2985.2537 2994.1729 2995.8206 2996.7835 3005.8628 3013.9284 3037.9731 3054.8502 3069.2950 3078.2051 3083.9834 3086.3012 3100.3868
redmass: 3.3689 3.8270 3.0161 2.3027 3.3068 2.6423 2.2669 1.2515 1.3043 2.6775 2.0723 2.8020 2.3296 2.4216 3.7072 2.9527 3.4499 2.4280 3.0702 2.9769 4.2633 2.2318 1.8001 2.8642 2.5678 2.7447 2.4657 1.6012 1.6786 2.7388 2.4785 2.4815 1.9269 5.2753 2.1945 2.0802 2.0742 1.4101 1.9379 1.6965 1.6193 1.3433 1.4669 1.1804 1.2294 1.2117 1.2430 1.2942 1.3073 1.3811 1.3523 1.3787 1.3940 1.2580 1.3485 1.3019 1.1499 1.0918 1.0879 1.0676 1.0622 1.0865 1.0589 1.0475 1.0675 1.0864 1.0453 1.0443 1.1019 1.0600 1.0424 1.0727 1.0626 1.0993 1.0662 1.0689 1.0870 1.0992 1.1012 1.1028 1.0987 1.1047 1.1001 1.0971
irintensity: 0.2120 0.6907 8.6677 2.2387 4.3291 2.1363 0.2603 1.0630 3.5750 7.1568 2.9985 2.4835 4.4765 1.3621 14.4566 2.5349 8.0446 5.0045 1.1445 0.6221 22.9083 11.0650 1.0474 11.9023 9.7236 30.5252 54.9336 29.6578 2.9603 150.6038 41.5443 41.3401 18.4158 102.4522 45.0715 12.1856 25.4287 5.3704 8.7702 9.6919 20.7237 10.6472 11.6879 4.6535 7.0986 7.2354 22.6263 1.1410 3.7004 0.6774 2.1538 4.6418 0.4493 2.3773 11.1575 16.8089 0.5479 7.5669 11.1378 11.3482 8.4368 12.7684 14.3284 12.2248 3.0449 5.2270 50.2347 115.4058 44.3467 40.8740 14.5326 40.0950 45.0323 48.8363 43.6856 68.3611 18.2797 33.0501 43.9706 47.9292 39.7648 35.9147 32.1622 29.7589
temp: 298.150 k
press: 1.00000 atm
elementType: 8 8 8 6 6 6 6 6 6 6 6 6 1 1 1 1 1 1 1 1 1 1 1 1 1 1 1 1 1 1
symmnumber: 1
zpe: 687169.8 jmol-1
zpe.correction: 0.261729 hartree
zpe.thermalcorrener: 0.275303 hartree
zpe.thermalcorrenthalpy: 0.276247 hartree
zpe.thermalcorrgfe: 0.221223 hartree
zpe.sumelectzpe: -578.391232 hartree
zpe.sumelectthermal: -578.377658 hartree
zpe.sumelectthermalent: -578.376713 hartree
zpe.sumelectthermalfe: -578.431737 hartree
dipole: 1.5269 -0.3469 -1.3189
dipole: 2.0472
quadrupole: -64.8123 -67.9826 -77.9396
quadrupole: -0.3813 0.2542 0.8211
quadrupole: 5.4325 2.2623 -7.6948 -0.3813 0.2542 0.8211
hfenergy: -578.6529607 hartree
pointgroup: C01 [X(C9H18O3)]
dipole: -0.5935544 0.0534109 -0.5418223 debye
polarizability: 115.7876258|2.7737639|112.3027331|-0.6959786|-2.02256|90.2894932 unknown
InChI: InChI=1S/C9H18O3/c1-8(7-10-2)12-9-5-3-4-6-11-9/h8-9H,3-7H2,1-2H3
charge 0 multiplicity 1
30 atoms
O  1.245961 -0.166389 1.398358
O  -0.112381 -1.003058 -0.430005
O  -2.055996 1.203326 -0.043313
C  2.273441 -1.056085 -0.691724
C  1.13062 -1.156854 0.33126
C  2.398387 0.384134 -1.243542
C  2.516085 1.394934 -0.076116
C  1.326881 1.229688 0.885023
C  -1.351199 -1.082759 0.38459
C  -2.379766 -0.19965 -0.321016
C  -1.822248 -2.544696 0.493118
C  -2.918469 2.123218 -0.77985
H  2.087358 -1.78061 -1.504935
H  3.211324 -1.347236 -0.180805
H  1.139259 -2.120386 0.879584
H  1.498449 0.619121 -1.842371
H  3.27535 0.457573 -1.913569
H  3.462416 1.223795 0.474367
H  2.534904 2.434172 -0.459054
H  1.440521 1.841921 1.794947
H  0.370031 1.48083 0.387364
H  -1.143582 -0.659238 1.386854
H  -2.346281 -0.398155 -1.415048
H  -3.402356 -0.43285 0.053069
H  -1.023766 -3.178338 0.917925
H  -2.705057 -2.627699 1.154297
H  -2.085277 -2.948553 -0.501315
H  -2.599614 3.139924 -0.500488
H  -3.988118 1.987957 -0.508838
H  -2.810578 1.991664 -1.877966
