program: Gaussian 09
title: 000233626
version: EM64L-G09RevD.01
frameworkgroup: C1[X(C8H14N4O4)]
method: RPBEPBE
basis: SDD
operation: Freq
keyword: #p
keyword: freq=noraman
keyword: PBEPBE/SDD
title: #p freq=noraman PBEPBE/SDD
converged: YES YES NO NO
title: Mulliken charges:
elementType: O O O O N N N N C C C C C C C C H H H H H H H H H H H H H H
charge: -0.287278 -0.287378 -0.278001 -0.278026 -0.068324 -0.068401 -0.596998 -0.597078 -0.276840 -0.276858 0.164064 0.164348 0.190616 0.190495 -0.759118 -0.758812 0.246403 0.213909 0.246402 0.213900 0.257723 0.200423 0.339015 0.257972 0.200272 0.338769 0.334065 0.320331 0.334069 0.320333
chargesum: 0.00000
title: Mulliken charges with hydrogens summed into heavy atoms:
elementType: O O O O N N N N C C C C C C C C
charge: -0.287278 -0.287378 -0.278001 -0.278026 -0.068324 -0.068401 0.057398 0.057325 0.183472 0.183444 0.164064 0.164348 0.190616 0.190495 0.038044 0.038202
polarizability: 1.79669619e+02 -2.44065956e-03 1.22454173e+02 -2.44688254e+01 -1.82826273e-03 1.13140048e+02
1716.lowfreq: -6.6262 -0.0007 -0.0005 -0.0002 2.2156 10.6191 42.7734 45.9592 58.2118
frequency: 42.7614 45.9304 58.1458 68.6214 91.9174 97.1664 106.8367 119.2231 122.6517 127.0161 130.0606 177.3800 194.9729 273.9484 288.2396 337.7384 387.6430 397.6909 415.2762 420.5574 460.5178 465.2574 466.2081 520.5135 520.8524 553.1398 564.3818 607.1314 626.6256 654.1398 655.0461 712.2367 714.9102 735.5435 761.7858 839.6642 858.2172 905.5467 909.4522 1003.9839 1010.3288 1024.1157 1024.5038 1041.1785 1052.3769 1053.1494 1056.7729 1088.1496 1232.0690 1240.5756 1247.6812 1281.2233 1353.8436 1361.7113 1382.6226 1386.2937 1408.1416 1408.1752 1428.8085 1432.1196 1459.1194 1460.2344 1495.7791 1497.1846 1593.8889 1596.4833 1632.6669 1639.6078 1659.9135 1662.7572 2990.7336 2990.9525 3013.0333 3019.8347 3087.6087 3087.7826 3088.4479 3090.2639 3100.1333 3101.3652 3535.9239 3536.1784 3695.6975 3695.7080
redmass: 5.7843 3.6800 3.4901 6.1036 4.9974 8.4365 3.6328 4.1542 2.8064 1.2897 1.2613 4.7518 4.0585 10.4527 3.7531 2.3533 3.6915 3.0213 3.2566 3.9730 2.3374 1.1488 1.1504 1.8719 1.9328 4.0359 4.4437 4.5948 5.8088 1.5253 1.5190 6.3804 9.8592 5.6777 7.0605 4.1363 4.2397 3.3060 3.3892 1.7896 1.5230 2.5064 2.8783 1.9740 1.5872 1.5877 2.4345 3.2510 1.2476 2.3965 3.2696 1.1111 1.2784 1.3144 3.1992 3.1529 1.2045 1.2059 1.0944 1.1003 1.0933 1.0989 1.1087 1.1072 1.7767 1.8163 3.0428 2.6424 5.9725 8.9760 1.0362 1.0362 1.0557 1.0597 1.0992 1.0999 1.1041 1.1065 1.1016 1.1012 1.0456 1.0457 1.1040 1.1040
irintensity: 3.4509 2.4082 3.2509 1.2181 24.0244 1.9865 0.2779 3.8380 3.9682 0.8946 0.0196 14.3366 3.3391 9.1069 11.0019 6.5737 10.7229 0.8733 4.1068 0.0966 4.5489 105.2287 150.4985 24.6050 108.5864 2.8883 2.7050 1.5374 7.2400 85.1284 121.3304 9.0855 57.1560 22.0461 6.3058 1.6646 21.2893 99.2747 62.3907 150.2402 44.9592 74.1676 41.9879 27.3965 22.9935 4.5327 322.1039 24.8748 21.7308 84.7730 300.6002 0.7974 16.0153 4.4336 328.0155 38.8292 36.9206 38.9576 13.8907 30.3650 19.6561 1.5434 26.2495 21.0574 209.1102 0.0192 37.7026 26.7652 321.6788 2039.5068 99.9767 13.1999 9.5927 72.4460 33.0055 35.2586 1.7955 8.0592 0.5347 42.7409 111.6666 36.5456 0.7399 67.8659
temp: 298.150 k
press: 1.00000 atm
elementType: 8 8 8 8 7 7 7 7 6 6 6 6 6 6 6 6 1 1 1 1 1 1 1 1 1 1 1 1 1 1
symmnumber: 1
zpe: 614187.1 jmol-1
zpe.correction: 0.233932 hartree
zpe.thermalcorrener: 0.251875 hartree
zpe.thermalcorrenthalpy: 0.252819 hartree
zpe.thermalcorrgfe: 0.187301 hartree
zpe.sumelectzpe: -831.930084 hartree
zpe.sumelectthermal: -831.912140 hartree
zpe.sumelectthermalent: -831.911196 hartree
zpe.sumelectthermalfe: -831.976715 hartree
dipole: 0.0019 -0.1914 -0.0003
dipole: 0.1914
quadrupole: -50.4857 -81.4547 -100.3032
quadrupole: 0.0053 -12.3378 -0.0058
quadrupole: 26.9288 -4.0402 -22.8887 0.0053 -12.3378 -0.0058
hfenergy: -832.1640155 hartree
pointgroup: C01 [X(C8H14N4O4)]
dipole: -0.000688 -0.0752974 0.0003759 debye
polarizability: 172.5327788|-0.0417713|122.4541112|-31.9780842|-0.0202196|120.2769506 unknown
InChI: InChI=1S/C8H14N4O4/c1-5(9)11-7(13)15-3-4-16-8(14)12-6(2)10/h3-4,9-10H2,1-2H3
charge 0 multiplicity 1
30 atoms
O  1.619521 1.00518 0.290658
O  -1.620526 1.002695 -0.295572
O  0.558035 -0.541721 1.70577
O  -0.557826 -0.548696 -1.70482
N  2.602387 -1.070072 0.684256
N  -2.601616 -1.075343 -0.681514
N  4.364396 -1.986837 -0.473151
N  -4.3634 -1.987901 0.479351
C  0.529867 1.974365 0.548551
C  -0.531714 1.971819 -0.557114
C  1.510031 -0.269608 0.929491
C  -1.510216 -0.274438 -0.929807
C  3.181208 -1.282728 -0.482655
C  -3.179705 -1.284675 0.486466
C  2.67042 -0.850079 -1.846721
C  -2.668858 -0.847202 1.848923
H  0.067062 1.757843 1.528247
H  1.036972 2.955041 0.574366
H  -0.068733 1.752112 -1.536015
H  -1.039611 2.951985 -0.586519
H  2.963827 0.199495 -2.025691
H  3.090015 -1.480026 -2.650726
H  1.569706 -0.888531 -1.887794
H  -2.957194 0.204805 2.021693
H  -3.092541 -1.470702 2.655776
H  -1.568364 -0.890788 1.891532
H  4.74397 -2.290017 0.423257
H  4.831026 -2.247478 -1.337244
H  -4.743129 -2.293833 -0.41606
H  -4.830713 -2.244564 1.344264
