program: Gaussian 09
title: 000233613
version: EM64L-G09RevD.01
frameworkgroup: C1[X(C8H8N2O3)]
method: RPBEPBE
basis: SDD
operation: Freq
keyword: #pfreq=noraman
keyword: PBEPBE/SDD
title: #p freq=noraman PBEPBE/SDD
converged: YES YES NO NO
title: Mulliken charges:
elementType: O O O N N C C C C C C C C H H H H H H H H
charge: -0.257414 -0.208129 -0.212330 0.025736 -0.602846 0.481148 -0.650634 -0.323579 -0.404721 0.373397 -0.353578 -0.348428 0.244562 0.263352 0.211941 0.288481 0.238535 0.286844 0.285915 0.320304 0.341444
chargesum: 0.00000
title: Mulliken charges with hydrogens summed into heavy atoms:
elementType: O O O N N C C C C C C C C
charge: -0.257414 -0.208129 -0.212330 0.025736 0.058903 0.481148 -0.175342 -0.035099 -0.166186 0.373397 -0.066734 -0.062513 0.244562
polarizability: 1.68227356e+02 3.72962987e+00 1.17830562e+02 -6.26282876e+00 3.85844375e+00 5.92061880e+01
1716.lowfreq: -10.4300 -2.1019 -0.0008 -0.0006 0.0003 9.2277 27.3029 31.8465 65.5508
frequency: 27.1614 31.8235 65.5430 76.8085 139.0039 198.7881 282.7675 316.3936 344.7517 409.1874 412.7026 472.6946 489.7270 505.6426 529.9894 569.4472 626.8169 635.2695 669.5271 701.8592 725.0152 778.8988 820.2090 844.5878 854.4663 879.0155 932.8361 984.7458 1000.6989 1006.8207 1054.5199 1092.5287 1110.3131 1158.8474 1182.7328 1205.2089 1222.4789 1273.2102 1304.0640 1346.3520 1367.4984 1402.2214 1422.0149 1456.9613 1481.0212 1593.1202 1598.0396 1609.7030 1649.0200 3004.3798 3066.2740 3135.3245 3155.5215 3181.8270 3184.5743 3518.1729 3673.3412
redmass: 4.6855 6.0375 7.9433 6.3091 6.8492 7.2353 5.9700 5.0761 5.6623 2.7554 2.3591 3.3497 1.5579 5.6633 1.7706 3.0769 6.5411 1.8916 4.2898 3.9098 4.3380 6.9750 3.0695 2.5733 1.4449 1.9750 1.9987 1.3698 1.3634 3.0956 1.7200 3.1837 1.3468 1.1896 1.3508 2.6655 5.5616 1.4591 1.3473 4.1316 6.9774 8.1467 3.2062 1.1126 2.3519 2.7514 2.9348 3.6992 3.3826 1.0595 1.1022 1.0906 1.0910 1.0944 1.0957 1.0452 1.1042
irintensity: 12.2056 4.1516 1.4564 2.8907 1.5207 5.5051 2.8413 0.8651 3.2591 0.3729 2.3651 3.9784 42.7701 5.9434 136.1079 48.2397 3.6538 69.5280 43.2148 49.6826 10.6141 9.8313 14.3834 9.3488 0.3150 32.5788 14.2264 2.0672 0.6749 5.2413 1.1781 17.9804 14.8699 46.2518 61.8941 2.8873 319.0102 6.2481 2.9411 186.5007 124.4891 2.3272 46.5914 17.8627 12.3561 56.5964 45.4726 29.1287 280.5465 15.7559 13.9469 12.8202 0.5266 0.8103 2.1645 40.2442 25.9453
temp: 298.150 k
press: 1.00000 atm
elementType: 8 8 8 7 7 6 6 6 6 6 6 6 6 1 1 1 1 1 1 1 1
symmnumber: 1
zpe: 405429.2 jmol-1
zpe.correction: 0.154420 hartree
zpe.thermalcorrener: 0.166063 hartree
zpe.thermalcorrenthalpy: 0.167008 hartree
zpe.thermalcorrgfe: 0.114461 hartree
zpe.sumelectzpe: -643.820681 hartree
zpe.sumelectthermal: -643.809038 hartree
zpe.sumelectthermalent: -643.808094 hartree
zpe.sumelectthermalfe: -643.860641 hartree
dipole: 6.2047 4.3336 0.0522
dipole: 7.5685
quadrupole: -88.9963 -73.2767 -72.0099
quadrupole: 12.2779 7.8358 1.5763
quadrupole: -10.9020 4.8176 6.0844 12.2779 7.8358 1.5763
hfenergy: -643.9751012 hartree
pointgroup: C01 [X(C8H8N2O3)]
dipole: -2.557098 -1.3928619 -0.6226377 debye
dipolederiv: -0.6252198 0.056198 0.1108668 -0.0240936 -0.9795296 0.0124082 0.1899474 -0.1534491 -0.461507 -0.7175779 -0.1636322 -0.1579322 -0.2147463 -0.632438 -0.1339526 -0.1913098 -0.1322989 -0.3046439 -0.7494465 0.221787 -0.0830623 0.2784593 -0.6715687 -0.0275498 -0.0988442 -0.0275923 -0.2636165 1.808283 -0.0829357 0.3953867 -0.077806 1.0575848 0.1616869 0.4740602 0.1559637 0.3411879 -1.0107423 -0.329677 -0.0069335 -0.2917131 -0.5894613 0.2321931 0.2105559 0.3287367 -0.5923187 0.7160604 -0.0892233 0.0789799 -0.0118746 0.0629252 -0.0278693 0.2701092 -0.0323058 -0.0231418 -0.480615 0.1353862 0.1434035 0.2871645 0.0551644 -0.0118278 0.203749 -0.0676631 -0.0640082 -0.3429852 -0.1419732 -0.0597464 -0.2720685 0.0028879 -0.0221969 -0.127733 0.012484 -0.1519834 -0.3739912 0.1618464 0.0230877 0.2466244 0.0186291 0.1035887 -0.0267193 0.0945947 -0.118451 -0.7368047 0.0321966 -0.1778793 0.0058569 0.0248698 0.0019229 -0.2249263 0.0037496 -0.0067468 0.202007 0.0856003 0.0932839 -0.1876347 -0.0094018 -0.0381531 0.0355933 0.049598 -0.0753248 0.2016915 -0.1086752 0.0493732 0.1996666 -0.0450546 0.0513636 0.1170668 -0.0189898 -0.065677 1.0818752 0.266074 -0.4605287 0.1942906 1.3160106 -0.1103757 -0.9096681 -0.0128523 0.6074944 0.0498456 0.0004456 -0.0297649 0.0095056 0.0340956 0.0849221 -0.049875 0.046793 0.0108428 0.0013273 -0.0274772 -0.0003838 -0.095342 -0.1046908 -0.09165 0.0219251 -0.0355966 0.0664219 0.1220004 0.0629236 -0.0247474 0.0469297 0.0455835 -0.0087235 -0.0100873 -0.020623 0.1358824 0.025188 -0.0862215 -0.058175 -0.0769938 -0.0208691 -0.057473 -0.0477985 -0.0602193 0.1165814 0.1016532 -0.0505661 -0.0274164 -0.0190412 0.0676243 -0.0282554 -0.0290621 -0.0356305 0.1543695 0.0964659 0.0637999 -0.0036724 0.0297579 0.058892 -0.0151083 -0.0096489 -0.0061744 0.1665683 0.3316337 0.0049171 0.0942725 0.0152758 0.1375186 -0.0439838 0.0832247 -0.0451066 0.2640895 0.2993515 -0.0107933 0.1015882 -0.0422178 0.1712281 -0.0309662 0.1194409 -0.0434179 0.263981 unknown
polarizability: 166.4244482|-4.1926968|115.6693913|15.504918|11.0215434|63.1702662 unknown
InChI: InChI=1S/C8H8N2O3/c9-8(11)5-6-1-3-7(4-2-6)10(12)13/h1-4H,5,9H2
charge 0 multiplicity 1
21 atoms
O  -3.381723 1.847169 0.213995
O  3.658604 0.968717 0.82444
O  3.724008 -1.265045 0.367178
N  3.107531 -0.130794 0.429932
N  -4.240259 -0.283133 0.542789
C  -1.022032 -0.012712 -0.747022
C  -2.484611 0.026218 -1.177941
C  -0.370209 1.167551 -0.295603
C  -0.291446 -1.228271 -0.800562
C  1.681689 -0.090028 0.025122
C  0.981664 1.135326 0.093491
C  1.063331 -1.278615 -0.417664
C  -3.401523 0.618372 -0.086471
H  -2.593548 0.689794 -2.056204
H  -2.819181 -0.981373 -1.481323
H  -0.94029 2.100461 -0.237733
H  -0.783785 -2.142892 -1.150534
H  1.500315 2.030886 0.445398
H  1.641935 -2.205254 -0.454552
H  -4.244208 -1.27605 0.318233
H  -4.855661 0.060674 1.280634
