program: Gaussian 09
title: 000233631
version: EM64L-G09RevD.01
frameworkgroup: C1[X(C20H24N4O5)]
method: RPBEPBE
basis: SDD
operation: Freq
keyword: #p
keyword: freq=noraman
keyword: PBEPBE/SDD
title: #p freq=noraman PBEPBE/SDD
converged: YES YES NO NO
title: Mulliken charges:
elementType: O O O O O N N N N C C C C C C C C C C C C C C C C C C C C H H H H H H H H H H H H H H H H H H H H H H H H
charge: -0.280680 -0.262995 -0.268867 -0.219099 -0.213458 -0.110316 -0.498215 -0.501167 0.020431 -0.371381 -0.328197 -0.336608 -0.304632 -0.671187 -0.668626 0.180431 0.235034 0.487963 -0.340328 -0.335029 -0.318093 -0.448922 0.499301 0.280852 -0.426230 -0.297569 0.391784 -0.346232 -0.363946 0.236316 0.216781 0.190585 0.207609 0.227743 0.191947 0.231187 0.240538 0.208336 0.227825 0.208675 0.208643 0.225505 0.206402 0.273146 0.272275 0.306997 0.220384 0.296349 0.298525 0.227787 0.316928 0.288129 0.287368
chargesum: 0.00000
title: Mulliken charges with hydrogens summed into heavy atoms:
elementType: O O O O O N N N N C C C C C C C C C C C C C C C C C C C C
charge: -0.280680 -0.262995 -0.268867 -0.219099 -0.213458 -0.110316 -0.201866 -0.202642 0.020431 0.081716 0.069997 0.083081 0.167092 -0.026350 -0.028077 0.180431 0.235034 0.487963 -0.067182 -0.062754 -0.011096 -0.228538 0.499301 0.280852 -0.198443 0.019359 0.391784 -0.058103 -0.076578
polarizability: 5.73284980e+02 3.11786968e+01 2.65735555e+02 1.08050510e+01 -2.46173693e+01 1.42172805e+02
1716.lowfreq: -3.5298 -0.0015 0.0006 0.0010 1.3987 5.2402 8.6293 11.5260 17.1217
frequency: 7.7258 11.1645 16.5131 25.8587 32.4103 36.9546 56.6321 61.6661 67.3077 70.6598 77.2807 84.1118 88.6956 104.4945 121.7179 144.0004 152.0276 168.3614 179.2756 202.1141 243.0070 245.2636 254.3434 285.3982 295.3243 298.7622 309.7816 314.5961 349.5499 372.0733 384.3565 394.1465 413.0060 416.6722 428.6569 450.7174 459.2311 471.9117 506.0715 509.3423 521.3348 539.5899 601.2486 623.4137 630.2951 634.6854 666.3909 666.8696 678.1858 700.9879 736.0558 737.6734 746.0351 757.8716 767.9328 775.0323 793.9007 795.3587 805.7054 815.8263 831.8329 838.4259 878.0696 880.8017 881.1121 903.8671 917.8538 977.6010 980.3912 989.2832 995.9334 1000.8786 1005.2344 1006.9073 1010.4929 1047.2086 1060.3563 1070.0579 1076.1412 1081.0468 1084.2876 1097.3003 1119.0189 1124.3640 1125.7593 1167.6917 1180.5567 1182.6247 1186.2241 1207.6224 1225.4791 1247.6980 1251.0439 1254.8721 1280.6487 1282.2419 1291.5566 1299.1239 1301.3142 1309.1784 1328.3140 1353.4811 1364.2466 1369.8645 1372.5855 1383.1772 1386.2531 1388.3287 1389.7185 1422.6968 1431.4362 1447.1850 1461.1619 1463.2106 1472.2147 1479.5258 1484.8040 1487.4948 1488.1278 1491.0144 1499.8763 1504.2846 1521.1113 1588.3842 1599.4879 1613.6699 1615.9993 1622.8540 1660.6688 2857.8966 2869.5143 2919.0753 2981.8350 2983.5202 3027.3689 3033.4675 3037.9281 3054.6329 3074.2829 3076.5063 3090.6541 3091.1021 3111.8606 3121.7027 3126.7649 3163.6833 3173.4991 3178.6455 3185.8406 3204.3244 3206.7653 3514.4474 3526.5466
redmass: 4.6377 4.0522 4.7456 7.8192 4.0546 5.9013 5.5659 5.3426 3.3272 6.3614 2.7637 4.7040 3.4638 3.7204 5.7022 4.2577 4.4698 2.8258 2.6204 1.3425 3.3229 3.0559 2.3707 2.5227 3.6320 3.6468 4.2441 3.7954 6.1623 6.0493 4.7992 3.4444 2.9619 2.9973 4.2646 3.5570 1.7571 3.5083 3.0468 7.1911 4.0947 2.3358 7.0767 7.1125 7.1461 1.2057 6.7907 4.6793 4.2424 10.0271 4.6895 3.2177 2.9452 4.4929 4.2759 7.4754 1.2484 1.1837 2.0517 2.8926 1.3904 1.4126 1.4928 1.8664 3.2213 5.2016 2.1964 1.3424 1.3609 2.2416 4.9195 3.7307 3.0717 1.3965 1.3170 3.3567 2.5695 2.2027 2.1554 2.6041 2.1875 2.9610 1.2937 1.4130 1.6099 2.4494 1.6017 1.5457 1.2305 2.2512 4.4116 1.4664 2.0044 3.3845 1.1707 1.6575 1.2098 1.2044 1.5359 1.5067 1.3398 6.8202 1.3287 1.3232 4.6579 1.3314 1.2469 1.2581 6.1030 4.5077 4.9589 1.0978 1.0544 1.0523 1.0532 1.0495 1.0745 1.0737 2.5302 1.0784 2.0907 2.5467 2.5262 4.9939 6.1376 9.4255 6.0384 5.8383 4.1064 1.0720 1.0712 1.0696 1.0357 1.0357 1.0883 1.0877 1.0614 1.0892 1.0983 1.0982 1.1004 1.1003 1.0901 1.0909 1.1076 1.0946 1.0908 1.0909 1.0945 1.0951 1.0954 1.0768 1.0757
irintensity: 0.1169 0.0489 1.8881 0.7294 0.6629 1.3824 0.5594 5.3771 0.8618 2.5135 0.3014 5.5627 0.8203 1.2980 0.0232 0.0707 2.8675 1.2293 1.0047 0.0481 5.6797 9.0748 0.4978 1.1369 0.9794 2.4572 4.2658 10.3196 0.4110 15.3583 13.3436 7.7824 0.0011 0.0518 3.5300 3.8519 0.4192 10.1205 41.5135 2.4599 10.4454 0.3811 1.2880 1.7936 0.7854 103.0812 3.2583 29.6019 45.5123 18.4146 5.4835 11.7321 3.5021 17.4787 12.9964 3.8573 7.1457 3.8453 11.8525 2.4865 22.0369 38.0399 11.0880 81.6845 29.2834 41.6637 18.5699 0.9990 0.1406 3.1925 1.8635 6.9426 76.8115 6.8776 0.4911 124.8387 237.6799 222.9694 31.7607 10.9646 3.8618 30.8648 28.3596 14.2460 13.1608 1108.7630 26.9411 19.8881 100.0432 45.1372 672.5536 5.4188 43.2126 620.1787 0.9102 22.5192 18.0432 10.5616 50.1478 43.2470 31.0486 82.4327 15.2709 12.4432 127.9510 19.9971 21.4558 12.7786 373.5926 21.7024 27.4797 34.2252 2.1307 5.9419 1.4473 1.3491 8.5720 11.5115 137.7602 12.0022 350.6489 1161.0900 35.8241 29.2301 58.9324 347.0159 176.8972 81.7811 99.4166 55.6868 141.7731 67.5723 30.9886 34.9282 8.2887 22.4053 31.8327 19.6439 50.6240 73.5838 26.2219 58.9372 20.9054 14.6312 13.3163 3.7821 0.5679 2.3427 2.9958 4.7233 6.8692 2.5572 25.3520
temp: 298.150 k
press: 1.00000 atm
elementType: 8 8 8 8 8 7 7 7 7 6 6 6 6 6 6 6 6 6 6 6 6 6 6 6 6 6 6 6 6 1 1 1 1 1 1 1 1 1 1 1 1 1 1 1 1 1 1 1 1 1 1 1 1
symmnumber: 1
zpe: 1100927.6 jmol-1
zpe.correction: 0.419321 hartree
zpe.thermalcorrener: 0.448227 hartree
zpe.thermalcorrenthalpy: 0.449171 hartree
zpe.thermalcorrgfe: 0.353072 hartree
zpe.sumelectzpe: -1369.453929 hartree
zpe.sumelectthermal: -1369.425023 hartree
zpe.sumelectthermalent: -1369.424079 hartree
zpe.sumelectthermalfe: -1369.520178 hartree
dipole: -4.7299 -4.8300 2.1121
dipole: 7.0825
quadrupole: -244.0426 -160.7525 -172.9319
quadrupole: -45.7736 0.6118 -3.8731
quadrupole: -51.4669 31.8231 19.6438 -45.7736 0.6118 -3.8731
hfenergy: -1369.8732503 hartree
pointgroup: C01 [X(C20H24N4O5)]
dipole: 1.9118938 1.5436184 1.3139101 debye
polarizability: 575.4295438|18.1963039|243.2520728|4.9537741|52.2581487|162.5117236 unknown
InChI: InChI=1S/C20H24N4O5/c1-3-23(4-2)13-14-29-19(25)15-5-7-16(8-6-15)21-20(26)22-17-9-11-18(12-10-17)24(27)28/h5-12,21-22H,3-4,13-14H2,1-2H3
charge 0 multiplicity 1
53 atoms
O  4.419941 -0.355024 -0.730367
O  4.838839 1.661617 0.37389
O  -2.574437 -0.538136 -0.484146
O  -10.224035 -0.179863 0.007812
O  -9.383741 -2.003528 -1.079863
N  7.981115 -1.316632 0.129052
N  -1.658959 1.358523 0.579191
N  -3.975252 1.077443 0.51707
N  -9.237755 -0.890021 -0.438436
C  6.514898 -1.22455 0.318589
C  8.578203 -2.584442 0.622983
C  8.698422 -0.096605 0.595073
C  5.889956 -0.541261 -0.913346
C  8.251902 -3.79202 -0.276208
C  10.008532 0.161036 -0.172746
C  4.02372 0.801867 -0.05249
C  2.544572 0.889811 0.085166
C  -0.266298 1.14844 0.386608
C  1.667717 -0.097364 -0.432095
C  1.998541 2.012411 0.760327
C  0.272651 0.019999 -0.289784
C  0.610194 2.14103 0.910599
C  -5.253584 0.536395 0.250426
C  -2.717817 0.542354 0.150857
C  -6.378909 1.274323 0.724019
C  -5.459205 -0.684161 -0.455397
C  -7.86793 -0.399085 -0.200692
C  -7.683506 0.813624 0.501941
C  -6.767347 -1.145625 -0.677134
H  6.240199 -0.654575 1.235603
H  6.086682 -2.236941 0.422252
H  8.266489 -2.801087 1.676278
H  9.674966 -2.449534 0.643936
H  8.023168 0.767118 0.450058
H  8.906268 -0.14813 1.693372
H  6.354771 0.443389 -1.093233
H  5.982958 -1.177393 -1.806048
H  8.735567 -4.706888 0.11425
H  8.614061 -3.609398 -1.302909
H  7.164866 -3.986588 -0.327793
H  10.491707 1.087169 0.190802
H  9.802128 0.268519 -1.251867
H  10.731944 -0.665065 -0.046508
H  2.090291 -0.961336 -0.952067
H  2.681609 2.770449 1.156512
H  -0.399324 -0.739548 -0.690603
H  0.199581 3.014411 1.434151
H  -1.888874 2.215436 1.087873
H  -3.985717 1.960621 1.032683
H  -6.226426 2.214759 1.268344
H  -4.596971 -1.245642 -0.815954
H  -8.556397 1.36695 0.857013
H  -6.949573 -2.07915 -1.216047
