program: Gaussian 09
title: 000022121
version: EM64L-G09RevD.01
frameworkgroup: C1[X(C10H12N2)]
method: RPBEPBE
basis: SDD
operation: Freq
keyword: #pfreq=noraman
keyword: PBEPBE/SDD
title: #p freq=noraman PBEPBE/SDD
converged: NO YES NO NO
title: Mulliken charges:
elementType: N N C C C C C C C C C C H H H H H H H H H H H H
charge: -0.463959 -0.075287 -0.181136 0.220941 0.267761 0.015555 -0.690608 -0.690624 -0.370473 -0.355146 -0.217578 -0.232547 0.197616 0.302790 0.244428 0.212314 0.218032 0.218041 0.212298 0.244442 0.230502 0.246596 0.222385 0.223657
chargesum: 0.00000
title: Mulliken charges with hydrogens summed into heavy atoms:
elementType: N N C C C C C C C C C C
charge: -0.161169 -0.075287 0.016480 0.220941 0.267761 0.015555 -0.015835 -0.015843 -0.139970 -0.108551 0.004807 -0.008889
polarizability: 1.77510783e+02 -2.67218124e+00 1.14202470e+02 2.17695488e-03 -1.20154240e-02 6.86171072e+01
1716.lowfreq: -7.1194 -0.0006 -0.0006 -0.0003 7.1944 8.0442 16.6702 85.5305 150.6071
frequency: 15.9895 85.5296 150.6067 207.6774 215.9985 250.7341 251.6483 279.0812 385.0297 392.8480 449.8272 467.6863 550.5746 581.8468 602.6126 612.9506 657.9384 718.4173 754.7223 771.3595 800.6205 857.1123 873.9447 888.8973 920.7450 934.9262 958.4446 961.7335 975.5821 1007.7274 1083.7313 1111.1123 1112.0285 1145.7271 1160.0751 1188.4249 1213.8259 1258.8051 1273.4964 1286.9975 1320.6804 1374.8286 1386.8587 1394.3310 1412.3248 1441.9378 1462.0470 1471.6787 1474.3274 1477.0639 1485.3199 1523.5277 1593.7039 1633.5087 2968.2415 2981.9217 2984.7548 3076.6778 3081.1231 3093.0594 3099.2917 3127.8144 3140.1413 3155.9071 3169.9777 3591.0513
redmass: 3.2054 3.5708 2.9529 1.2695 2.3267 1.1397 4.4720 2.6703 3.8043 2.9579 3.3726 3.9832 4.1666 3.3781 1.1829 6.7255 3.3845 4.9035 1.4095 3.7020 4.1525 1.5046 5.2714 3.1243 1.1490 1.3826 1.5029 4.3709 1.3028 2.0767 1.6197 1.5936 2.4671 1.8001 1.1406 1.7196 2.7858 2.2125 2.5537 1.3529 1.8303 1.1889 1.6055 1.5355 2.9129 3.5734 1.0441 1.0493 3.3206 1.0493 1.1885 3.4691 6.9067 7.4501 1.0819 1.0348 1.0369 1.1008 1.1000 1.1009 1.1000 1.0853 1.0904 1.0957 1.0992 1.0812
irintensity: 1.5925 0.8437 1.1371 0.4641 1.9136 0.4020 5.7329 0.5704 2.8313 3.0107 6.3158 2.4885 0.8279 3.6836 80.4769 0.8348 1.4484 12.0020 105.7515 4.5018 1.7728 0.1127 0.2615 3.0262 5.2366 4.5260 0.1458 6.1779 0.0641 4.6304 45.7360 2.6398 1.3150 9.6739 4.5572 2.7042 5.7967 66.4797 10.3625 0.2512 46.8012 15.5439 0.7454 28.8530 3.7271 39.1649 4.8115 2.7165 0.8935 15.7466 2.5259 61.8930 0.8143 2.7443 30.8819 33.8377 39.1796 18.9532 68.0295 5.4100 43.7275 0.1003 13.7190 27.5246 19.7433 34.5686
temp: 298.150 k
press: 1.00000 atm
elementType: 7 7 6 6 6 6 6 6 6 6 6 6 1 1 1 1 1 1 1 1 1 1 1 1
symmnumber: 1
zpe: 522404.0 jmol-1
zpe.correction: 0.198973 hartree
zpe.thermalcorrener: 0.209649 hartree
zpe.thermalcorrenthalpy: 0.210593 hartree
zpe.thermalcorrgfe: 0.161746 hartree
zpe.sumelectzpe: -496.912840 hartree
zpe.sumelectthermal: -496.902164 hartree
zpe.sumelectthermalent: -496.901220 hartree
zpe.sumelectthermalfe: -496.950067 hartree
dipole: -0.9334 3.4314 -0.0012
dipole: 3.5561
quadrupole: -63.3359 -64.7547 -75.5654
quadrupole: -3.1428 0.0013 -0.0042
quadrupole: 4.5495 3.1306 -7.6801 -3.1428 0.0013 -0.0042
hfenergy: -497.1118128 hartree
pointgroup: C01 [X(C10H12N2)]
dipole: 0.3699926 1.3492732 0.0000671 debye
dipolederiv: -0.6239125 0.073435 0.0000487 -0.1413298 -0.4770528 0.0000058 0.0000597 0.0000139 -0.2572534 -0.7233934 -0.1800988 0.0000567 -0.1600273 -0.4771567 0.0000284 0.0000288 -0.0000172 -0.2598151 0.0795225 0.0367243 0.0000266 0.1624797 0.1800396 0.0000524 0.0003597 0.000096 0.0880295 0.6137139 -0.1337949 -0.0001486 -0.0184559 0.6811879 0.0000515 -0.0003091 0.0000637 -0.0126783 0.229181 0.1641356 -0.0000052 0.5123616 -0.0080875 -0.0000819 0.0000365 -0.0000365 0.0717177 0.431234 0.0867472 -0.0000478 -0.2522182 -0.0521377 0.0000438 -0.000069 -0.0000028 0.0024292 -0.0473167 0.0068884 0.0260613 -0.0501887 0.0209724 -0.0256759 -0.0652712 -0.0428583 -0.012734 -0.0471526 0.0069382 -0.0260292 -0.0502395 0.0208476 0.0257525 0.0651298 0.0429024 -0.0126579 0.085922 -0.0800472 -0.0000658 -0.0468562 0.0523574 0.0000328 -0.0000487 0.0000277 -0.1883455 0.0623131 -0.0207911 -0.0000465 0.0266837 0.1129365 0.0000143 -0.0000427 0.0000225 -0.1553751 -0.0700459 -0.0197847 -0.0000164 -0.1566774 0.0525292 0.000058 -0.0000277 0.000028 -0.1830547 -0.072586 0.0804058 -0.0000022 0.1956848 -0.0174553 -0.0000212 0.0000077 0.0000017 -0.1845904 0.0148271 0.0185179 0.0000084 -0.0373209 -0.2016066 -0.0001472 -0.0000472 -0.0001405 0.0302089 0.1813461 -0.0044512 0.0000126 -0.001812 0.1569347 -0.0000161 -0.0000025 -0.0000284 0.3283782 0.1201602 -0.0567372 0.0026131 -0.0226629 -0.0930563 -0.029282 -0.0033573 0.0220413 0.0831846 -0.2499949 -0.0223099 0.0347251 -0.0084737 0.0929387 -0.0164427 0.0275603 -0.0137844 0.0730777 0.0875096 0.0551254 -0.0861328 0.0350608 0.0376796 0.0952183 -0.0571165 0.0641345 -0.1178323 0.0875903 0.0549758 0.0860914 0.0349398 0.037889 -0.0950209 0.0570204 -0.0639729 -0.1181142 -0.2500043 -0.0222322 -0.0345831 -0.008429 0.0929091 0.0164677 -0.0273325 0.0138183 0.073153 0.1202017 -0.05675 -0.0026832 -0.0226652 -0.0930305 0.029043 0.0033121 -0.0222356 0.0831962 0.0695702 0.0021328 0.0000193 0.0417556 -0.1118858 -0.0000365 0.000021 -0.0000293 0.1791384 0.0932467 0.0352433 0.0000139 -0.0040867 -0.0728816 -0.0000214 0.0000112 -0.0000227 0.1620091 -0.1124749 0.08173 0.0000541 0.0808922 0.0523584 -0.0000254 0.00005 -0.0000223 0.1634153 -0.079457 -0.1060025 0.0000297 -0.108415 0.0127704 0.0000024 0.0000271 0.0000009 0.1645131 unknown
polarizability: 177.5215157|2.5417994|114.191737|-0.0199464|0.0008554|68.6171077 unknown
InChI: InChI=1S/C10H12N2/c1-7(2)10-11-8-5-3-4-6-9(8)12-10/h3-7,11H,1-2H3
charge 0 multiplicity 1
24 atoms
N  0.41932 1.297055 -0.000194
N  0.662688 -0.968972 -0.000449
C  2.81075 0.38581 -0.000579
C  1.310983 0.208948 -0.000374
C  -0.888342 0.784895 -0.000039
C  -0.713887 -0.643596 -0.000198
C  3.429595 -0.239859 -1.279359
C  3.430209 -0.241615 1.277018
C  -2.15936 1.394157 0.000249
C  -1.847225 -1.488127 -0.000092
C  -3.277243 0.530939 0.000353
C  -3.123114 -0.886505 0.000183
H  3.029937 1.474303 0.000109
H  0.684889 2.280426 -0.000113
H  3.192783 -1.31705 -1.318405
H  4.528221 -0.116849 -1.274738
H  3.02899 0.230817 -2.195272
H  3.030129 0.227877 2.193765
H  4.528845 -0.1187 1.27197
H  3.193315 -1.318834 1.314771
H  -2.286922 2.482025 0.000381
H  -1.724622 -2.575527 -0.000214
H  -4.285799 0.959155 0.000563
H  -4.01794 -1.518771 0.000263
