program: Gaussian 09
title: 000233577
version: EM64L-G09RevD.01
frameworkgroup: C1[X(C15H11BrO)]
method: RPBEPBE
basis: SDD
operation: Freq
keyword: #p
keyword: freq=noraman
keyword: PBEPBE/SDD
title: #p freq=noraman PBEPBE/SDD
converged: YES YES NO NO
title: Mulliken charges:
elementType: Br O C C C C C C C C C C C C C C C H H H H H H H H H H H
charge: 0.014697 -0.216526 0.311169 0.478843 0.110177 -0.164004 -0.338807 -0.355202 -0.347050 -0.385206 -0.357475 -0.233215 -0.231357 -0.241688 -0.238563 -0.226222 -0.235419 0.253647 0.267741 0.264648 0.234998 0.237155 0.233291 0.231806 0.233220 0.231903 0.233200 0.234238
chargesum: 0.00000
title: Mulliken charges with hydrogens summed into heavy atoms:
elementType: Br O C C C C C C C C C C C C C C C
charge: 0.014697 -0.216526 0.311169 0.478843 0.110177 0.089643 -0.338807 -0.087461 -0.082403 -0.150208 -0.120320 0.000076 0.000449 -0.008468 -0.006659 0.006978 -0.001181
polarizability: 3.38950563e+02 9.36775781e+00 1.66612038e+02 1.18925080e+01 -1.34518256e+01 1.01474294e+02
1716.lowfreq: -8.2844 -2.2584 -0.0004 0.0004 0.0006 1.8892 22.2754 27.0879 46.6801
frequency: 22.1602 26.9911 46.6648 76.6768 94.9668 115.5204 160.9650 177.7894 207.0078 251.0912 254.2704 339.4020 398.4867 403.8446 408.2365 419.5551 503.0095 523.9405 553.8587 597.2289 613.1749 624.8523 657.7967 693.7085 696.5073 710.6398 770.2978 776.4647 799.0937 849.2311 857.6209 875.6303 910.0458 942.7120 946.5383 984.0302 986.3596 988.0449 989.7135 1002.9394 1003.7652 1018.2111 1027.9437 1048.5461 1087.5340 1095.2550 1174.8720 1175.1675 1189.5593 1200.0619 1210.8790 1269.3529 1295.5460 1320.3253 1347.6304 1385.3257 1390.9227 1434.1771 1438.2658 1478.1585 1482.3794 1516.3936 1577.5971 1585.9809 1605.1455 1608.6886 1612.3158 3075.3343 3125.2647 3129.4465 3134.2557 3140.1468 3148.4101 3151.7133 3160.9944 3165.3093 3170.7539 3190.1582
redmass: 6.4342 4.3089 4.9507 5.0354 6.5024 9.0475 6.6332 6.8010 5.5898 6.3878 5.0781 8.2867 3.3933 2.9993 3.5809 4.6119 5.5549 2.7292 6.1669 6.4056 6.4488 6.6195 6.3356 1.8328 2.5033 1.8959 1.8952 4.4264 2.6200 1.2646 1.2504 4.3317 1.4322 1.4555 1.5734 1.3973 1.4206 6.0286 5.8090 1.3412 1.3374 3.4450 2.2522 2.6843 1.6110 1.7024 1.0580 1.0720 1.1261 1.1200 3.1102 4.4200 1.4550 1.3333 1.2890 8.9640 4.7772 2.2767 2.2614 2.2294 2.1715 10.8910 5.6658 6.0327 6.2546 5.9491 6.6235 1.0850 1.0866 1.0852 1.0882 1.0883 1.0938 1.0927 1.0963 1.0997 1.1013 1.0946
irintensity: 1.6200 0.1131 0.7324 0.3449 2.5343 0.1238 1.3443 1.8662 0.0087 1.0892 5.0292 4.5772 0.2794 0.1164 1.4865 0.7892 26.6820 26.2338 13.6172 4.8664 0.3047 2.9173 27.3140 47.6143 34.9723 59.2319 37.7591 23.2564 13.5725 0.3354 3.8099 39.9269 9.1881 3.2032 16.9948 0.4311 3.1253 3.2133 1.5023 0.3563 0.0348 64.9176 4.9562 94.9395 4.2013 17.0465 1.2207 2.3276 47.0040 13.8965 90.5539 357.1456 21.6237 10.0714 29.5849 4.0904 13.3150 12.6082 34.3975 3.7277 32.7306 123.4204 6.1977 16.2968 123.3803 9.2780 39.0339 2.5666 3.9541 0.0533 0.6452 6.3649 25.2586 18.8916 21.2583 34.5832 21.1085 10.6441
temp: 298.150 k
press: 1.00000 atm
elementType: 35 8 6 6 6 6 6 6 6 6 6 6 6 6 6 6 6 1 1 1 1 1 1 1 1 1 1 1
symmnumber: 1
zpe: 552847.3 jmol-1
zpe.correction: 0.210568 hartree
zpe.thermalcorrener: 0.225266 hartree
zpe.thermalcorrenthalpy: 0.226210 hartree
zpe.thermalcorrgfe: 0.165669 hartree
zpe.sumelectzpe: -665.689294 hartree
zpe.sumelectthermal: -665.674597 hartree
zpe.sumelectthermalent: -665.673653 hartree
zpe.sumelectthermalfe: -665.734194 hartree
dipole: 0.8232 -1.3492 1.8526
dipole: 2.4352
quadrupole: -78.5490 -107.8775 -110.2386
quadrupole: 3.5908 0.3720 0.0782
quadrupole: 20.3394 -8.9892 -11.3502 3.5908 0.3720 0.0782
hfenergy: -665.8998629 hartree
pointgroup: C01 [X(C15H11Br1O1)]
dipole: -0.3258458 -0.076337 -0.8977185 debye
polarizability: 338.9801025|-14.0475001|137.1869648|4.8423694|35.1291736|130.8698279 unknown
InChI: InChI=1S/C15H11BrO/c16-14(11-12-7-3-1-4-8-12)15(17)13-9-5-2-6-10-13/h1-11H
charge 0 multiplicity 1
28 atoms
Br 0.134788 -1.746906 -0.311852
O  1.122496 1.445595 2.00529
C  2.5530 0.472963 0.338448
C  -2.636253 0.472133 0.230116
C  1.219742 0.691451 0.985127
C  -1.236754 0.734026 0.577794
C  -0.044565 0.070104 0.438153
C  3.711153 0.563862 1.156696
C  2.701813 0.288627 -1.062214
C  -3.56649 1.510523 0.551728
C  -3.144253 -0.709737 -0.390253
C  4.995286 0.441879 0.590433
C  3.989551 0.187962 -1.63009
C  -4.939034 1.380619 0.269573
C  -4.519727 -0.83596 -0.672087
C  5.137414 0.25331 -0.805702
C  -5.423708 0.202691 -0.346654
H  -1.081544 1.703512 1.079284
H  3.580843 0.734703 2.230422
H  1.818442 0.244498 -1.706756
H  -3.195883 2.425005 1.030901
H  -2.467789 -1.52666 -0.647914
H  5.882888 0.497518 1.229724
H  4.098688 0.059234 -2.712391
H  -5.628978 2.19097 0.528031
H  -4.889683 -1.751164 -1.14726
H  6.135689 0.163511 -1.248672
H  -6.49103 0.094932 -0.569078
