program: Gaussian 09
title: 000233606
version: EM64L-G09RevD.01
frameworkgroup: C1[X(C19H20N2O5)]
method: RPBEPBE
basis: SDD
operation: Freq
keyword: #p
keyword: freq=noraman
keyword: PBEPBE/SDD
title: #p freq=noraman PBEPBE/SDD
converged: YES YES NO NO
title: Mulliken charges:
elementType: O O O O O N N C C C C C C C C C C C C C C C C C C C H H H H H H H H H H H H H H H H H H H H
charge: -0.284113 -0.294217 -0.278122 -0.261801 -0.230959 -0.502672 -0.502739 0.489396 0.485936 0.242285 -0.446620 -0.327455 -0.320739 -0.356701 0.354907 -0.306203 -0.449764 0.273298 -0.409142 -0.295773 0.180505 -0.484221 0.247288 -0.257466 -0.657087 -0.665471 0.217182 0.309765 0.292000 0.270896 0.269647 0.291967 0.310761 0.217473 0.256904 0.303319 0.247139 0.247504 0.219095 0.234956 0.231046 0.217284 0.228404 0.224490 0.252033 0.215785
chargesum: 0.00000
title: Mulliken charges with hydrogens summed into heavy atoms:
elementType: O O O O O N N C C C C C C C C C C C C C C C C C C C
charge: -0.284113 -0.294217 -0.278122 -0.261801 -0.230959 -0.210673 -0.210772 0.489396 0.485936 0.242285 -0.229438 -0.017690 -0.049843 -0.087054 0.354907 0.004558 -0.232291 0.273298 -0.152237 0.007546 0.180505 0.010422 0.247288 0.196585 0.019647 0.026837
polarizability: 5.23704179e+02 -4.69853317e+00 2.21761162e+02 -1.89375673e+00 -6.76098167e-03 1.13983196e+02
1716.lowfreq: -0.0012 -0.0004 0.0009 2.7191 5.9508 9.3956 16.7839 20.9687 26.5344
frequency: 10.4606 17.7787 26.4354 33.6342 34.5344 43.0523 53.1741 58.6334 79.1022 85.6978 86.8534 94.2202 119.1722 139.4788 157.0972 170.3070 187.9896 197.9957 226.8466 251.5387 288.5579 300.6736 314.3146 328.4282 353.0231 363.1461 366.0672 383.4636 414.3450 414.9805 427.5311 460.3688 480.8626 518.5687 530.7257 538.2639 545.0144 617.8213 624.4462 627.6587 639.0392 663.5337 679.2026 697.8929 719.7408 728.3989 751.5046 757.7248 767.7118 790.3778 805.1038 818.3195 827.6859 835.1658 842.5211 852.9455 859.3227 881.7514 885.5415 962.1532 973.2085 987.9347 996.4596 997.9371 1004.8862 1011.7428 1012.1105 1015.0060 1058.2952 1073.1761 1084.1672 1095.8304 1108.9325 1123.4416 1126.4471 1152.9795 1155.1557 1176.3423 1186.1786 1198.4981 1242.6899 1251.6717 1255.3612 1281.5753 1282.7888 1302.8737 1307.6508 1335.4644 1359.2119 1367.3966 1372.9428 1391.4211 1399.4031 1417.7510 1425.5269 1440.6346 1455.5750 1463.9216 1471.5953 1480.1123 1484.6463 1489.2469 1495.4821 1507.4412 1521.3527 1584.4396 1596.0648 1620.5975 1623.0078 1623.7927 1650.5659 1655.7283 2991.9264 2997.5647 3000.6819 3027.4542 3044.9629 3086.5852 3091.2005 3097.9448 3103.4285 3110.9454 3112.3510 3116.9610 3157.4168 3164.8271 3178.2591 3201.9294 3202.5004 3212.3757 3516.4211 3529.3420
redmass: 3.1127 2.9116 4.7472 5.3245 4.8115 5.2878 3.0981 4.4883 5.3438 6.1139 4.6302 4.3477 4.4795 4.6880 5.5447 2.1071 3.6000 1.6478 1.3659 5.6003 3.5457 4.3068 4.0477 5.3904 6.2411 4.1915 5.4228 5.3052 2.9871 3.1053 3.9941 1.8414 4.7896 2.7233 2.6999 2.4984 6.2440 6.4747 1.1959 6.8142 6.1276 5.1414 4.2844 10.8432 3.6813 4.5383 3.9425 4.5313 7.0158 1.3398 3.4365 1.6754 1.3691 1.4343 3.5323 4.9408 1.4930 5.6995 1.4697 1.3217 1.3640 1.3140 4.7426 3.8812 2.9483 1.3759 2.0903 2.3141 4.3790 2.9305 1.6085 2.1515 2.7561 1.3679 1.3496 2.1414 1.7269 2.5629 1.1765 1.3645 1.1727 2.5590 2.8771 1.1754 1.7545 1.4616 1.4361 1.7486 1.3152 4.6107 5.7826 1.2361 1.2135 4.1798 4.5538 1.0861 1.1033 1.0434 1.0392 1.0549 1.0544 2.2765 2.2346 2.2910 2.7659 5.3916 5.5778 7.9615 6.6538 6.3008 9.4704 3.9863 1.0362 1.0548 1.0424 1.0590 1.0985 1.0975 1.1035 1.1004 1.1004 1.0903 1.0911 1.1056 1.0911 1.0910 1.0942 1.0947 1.0948 1.0942 1.0766 1.0756
irintensity: 0.3250 1.6557 0.9793 0.7771 0.2181 3.9263 0.8142 1.1955 6.7937 4.8694 0.7823 0.8846 0.9596 0.2724 0.4862 0.1520 3.6473 0.6339 5.7085 1.8199 1.0515 0.6844 2.8918 51.8188 7.4550 1.9296 2.7266 1.1890 0.0193 0.0542 5.3462 0.2453 3.4254 46.1463 0.9611 3.6050 1.1357 1.2113 116.4821 5.8463 0.1682 1.3930 38.5995 18.1646 0.0830 10.1968 3.9622 15.0011 1.8869 15.3936 2.9418 0.2454 26.7412 39.9135 5.7059 24.6803 77.2849 0.1897 55.6387 0.8026 0.0402 1.8662 2.1225 21.8578 4.3176 11.9676 112.0348 4.1600 579.1263 261.3537 0.0470 36.9488 625.0455 99.8772 16.9637 422.2919 9.2522 354.2729 90.2049 134.1074 0.8341 182.4917 405.1716 4.0955 40.4650 5.8636 76.7881 55.6642 8.4798 15.9562 619.4598 22.4449 21.4394 22.4568 34.2794 28.6797 41.8635 15.0635 12.9911 37.1904 24.8681 261.6357 4.8466 1385.4582 0.9525 135.8209 20.1474 256.3272 137.4094 29.1625 188.8738 103.3810 26.2805 34.6902 14.1911 43.1988 3.7603 44.2911 2.0970 29.9699 31.4888 21.4851 21.7071 33.3927 1.4834 3.2618 2.2738 7.9171 6.5274 2.8618 5.1562 19.0131
temp: 298.150 k
press: 1.00000 atm
elementType: 8 8 8 8 8 7 7 6 6 6 6 6 6 6 6 6 6 6 6 6 6 6 6 6 6 6 1 1 1 1 1 1 1 1 1 1 1 1 1 1 1 1 1 1 1 1
symmnumber: 1
zpe: 941339.3 jmol-1
zpe.correction: 0.358537 hartree
zpe.thermalcorrener: 0.384232 hartree
zpe.thermalcorrenthalpy: 0.385176 hartree
zpe.thermalcorrgfe: 0.297667 hartree
zpe.sumelectzpe: -1219.804124 hartree
zpe.sumelectthermal: -1219.778429 hartree
zpe.sumelectthermalent: -1219.777485 hartree
zpe.sumelectthermalfe: -1219.864994 hartree
dipole: -0.9810 4.2568 0.1250
dipole: 4.3701
quadrupole: -132.6752 -144.5330 -156.1170
quadrupole: 29.8357 1.7287 -0.9097
quadrupole: 11.7665 -0.0913 -11.6752 29.8357 1.7287 -0.9097
hfenergy: -1220.1626611 hartree
pointgroup: C01 [X(C19H20N2O5)]
dipole: -0.4089026 1.6516275 0.2470631 debye
polarizability: 523.4572448|0.9912217|220.3237902|-11.5590087|12.0282357|115.6675022 unknown
InChI: InChI=1S/C19H20N2O5/c1-3-17(22)26-16-11-9-15(10-12-16)21-19(24)20-14-7-5-13(6-8-14)18(23)25-4-2/h5-12,20-21H,3-4H2,1-2H3
charge 0 multiplicity 1
46 atoms
O  -6.478182 -0.877221 0.139378
O  7.629425 0.701057 -0.291372
O  0.108021 -1.071321 -0.133506
O  7.21071 -1.589914 -0.488916
O  -7.726614 1.099593 0.439465
N  1.22866 1.000398 0.043528
N  -1.101042 0.935328 0.138417
C  2.584245 0.597912 -0.05646
C  -2.442063 0.455644 0.13817
C  5.349671 -0.031907 -0.243814
C  3.568781 1.626314 0.00782
C  2.994689 -0.755618 -0.214239
C  4.934122 1.316212 -0.084411
C  4.365641 -1.052214 -0.305331
C  -5.159142 -0.325142 0.15578
C  -2.786167 -0.916232 -0.003328
C  -3.475487 1.417115 0.288608
C  0.077853 0.184351 0.004899
C  -4.141576 -1.292296 0.006606
C  -4.834287 1.044468 0.299761
C  6.781279 -0.415517 -0.351315
C  -8.85062 -1.093423 0.185632
C  -7.672262 -0.136966 0.276168
C  9.093443 0.42077 -0.375175
C  -10.203678 -0.392139 0.395612
C  9.6680 0.105378 1.009095
H  3.257862 2.672309 0.130524
H  2.240965 -1.542198 -0.262968
H  1.09363 2.008036 0.153402
H  5.688313 2.105926 -0.036037
H  4.697822 -2.088388 -0.42808
H  -1.015042 1.947838 0.250112
H  -1.997767 -1.660814 -0.118067
H  -3.222783 2.479851 0.400207
H  -4.425131 -2.343319 -0.102531
H  -5.616947 1.793537 0.417478
H  -8.805275 -1.588427 -0.803968
H  -8.6928 -1.899637 0.926993
H  9.512393 1.349534 -0.795408
H  9.250767 -0.419832 -1.073694
H  -10.355878 0.407349 -0.349189
H  -11.028327 -1.120257 0.302245
H  -10.259662 0.072504 1.394874
H  9.454646 0.92209 1.720334
H  9.243699 -0.832955 1.403686
H  10.765296 -0.01477 0.939009
