program: Gaussian 09
title: 000233627
version: EM64L-G09RevD.01
frameworkgroup: C1[X(C20H18N4O4)]
method: RPBEPBE
basis: SDD
operation: Freq
keyword: #p
keyword: freq=noraman
keyword: PBEPBE/SDD
title: #p freq=noraman PBEPBE/SDD
converged: YES YES NO NO
title: Mulliken charges:
elementType: O O O O N N N N C C C C C C C C C C C C C C C C C C C C H H H H H H H H H H H H H H H H H H
charge: -0.291877 -0.293751 -0.245789 -0.239804 -0.306062 -0.299183 -0.069073 -0.068230 0.277322 0.290920 -0.008706 -0.016571 0.229884 0.221070 -0.311535 -0.297638 0.285807 0.273255 -0.332232 -0.332168 -0.743400 -0.741595 -0.310068 -0.277408 -0.220272 -0.229274 -0.225798 -0.227434 0.272124 0.274159 0.254271 0.254448 0.238298 0.281712 0.245323 0.246635 0.266545 0.250478 0.251539 0.256783 0.252955 0.247139 0.225042 0.230467 0.230088 0.231602
chargesum: 0.00000
title: Mulliken charges with hydrogens summed into heavy atoms:
elementType: O O O O N N N N C C C C C C C C C C C C C C C C C C C C
charge: -0.291877 -0.293751 -0.245789 -0.239804 -0.306062 -0.299183 -0.069073 -0.068230 0.277322 0.290920 -0.008706 -0.016571 0.229884 0.221070 -0.039410 -0.023479 0.285807 0.273255 -0.077960 -0.077720 0.025162 0.015283 0.209942 0.214550 0.004770 0.001193 0.004290 0.004168
polarizability: 3.07472955e+02 1.82550651e+01 2.88465479e+02 -6.88798308e+01 8.12797781e+00 1.67046793e+02
1716.lowfreq: -5.1462 -1.9441 -0.0006 -0.0005 0.0003 6.1659 9.5839 17.1272 27.7168
frequency: 9.3308 16.9632 27.5370 42.9315 50.0558 67.5018 95.5954 100.8909 108.2649 136.2813 139.8386 159.2738 169.2857 180.8812 199.2696 244.3362 269.6018 277.6349 284.6327 290.9600 301.7364 320.3185 322.7902 331.9702 355.2339 388.3442 394.3233 395.3874 436.2776 437.4153 486.2275 486.4754 511.1619 559.2973 562.9730 577.5557 578.4246 627.8863 628.3756 641.0761 642.5107 667.4726 667.7085 702.6511 703.6885 739.3464 741.8369 759.7329 760.4721 773.5153 774.3971 825.2391 834.8149 855.0470 855.4037 874.9567 877.3080 929.9277 931.4381 951.0642 954.8168 965.8135 980.1518 984.6459 986.5781 1011.0540 1013.1515 1015.3446 1019.3379 1027.1946 1046.6958 1047.9639 1061.1867 1098.7943 1103.8200 1112.0330 1156.0591 1161.4060 1166.8968 1171.7955 1226.7129 1228.8470 1240.3493 1243.9194 1247.6443 1259.3062 1289.8437 1290.3269 1311.2963 1331.9314 1363.3747 1367.2975 1402.1802 1402.4316 1409.3199 1409.7186 1435.2013 1439.1147 1440.6004 1444.2934 1446.1494 1448.7678 1453.8906 1454.3247 1463.0293 1463.4636 1548.5169 1548.8938 1596.9954 1597.4294 1623.5379 1624.5942 1646.1497 1646.8211 3003.5439 3004.5318 3032.6399 3044.2552 3083.8694 3084.6167 3113.2505 3127.4370 3128.4353 3128.5025 3135.8297 3137.9599 3154.5952 3155.9923 3174.3013 3174.5035 3203.8162 3206.0244
redmass: 5.9596 5.4931 5.5678 6.1838 5.9923 8.1431 5.1319 4.7595 7.6904 4.0091 3.8029 4.5078 3.6028 1.1128 1.0509 6.3076 3.2825 3.6747 5.6490 5.5632 4.9072 4.2896 4.3127 4.8814 3.6334 4.3942 5.7929 6.4873 3.0731 3.1089 5.6486 5.6724 2.6636 4.3374 3.7861 3.8376 3.8290 7.1449 7.0067 5.0875 5.1488 5.6630 5.7397 8.8015 8.4697 6.0206 5.9230 1.8119 1.6974 2.4877 2.3180 4.4757 3.5465 6.1437 6.1628 1.4209 1.4045 5.9596 6.2734 1.3784 1.3744 2.5213 2.7455 1.3043 1.3011 2.3855 2.0201 2.0138 2.1343 4.6227 1.5084 1.5100 4.9459 2.3137 2.2124 2.1498 1.6565 1.2835 1.4169 2.1647 3.9023 3.8740 1.1797 3.9474 3.5661 1.1816 1.6181 1.6323 3.3485 3.7248 1.4991 1.4471 1.6611 1.6839 2.2627 2.4225 1.1185 1.5707 1.7269 2.0133 1.4641 1.1147 1.0548 1.0444 2.8130 2.7880 6.0854 6.1248 7.3552 7.3653 7.9089 7.9119 10.5536 10.5797 1.0374 1.0371 1.0598 1.0592 1.0963 1.0966 1.1074 1.1056 1.1003 1.1005 1.0865 1.0865 1.0924 1.0922 1.0978 1.0979 1.0946 1.0946
irintensity: 0.0851 0.1802 0.1486 0.0947 0.1912 0.0189 0.2266 2.0258 5.3876 0.4296 6.2826 0.1729 0.6998 0.3764 0.1347 2.3205 1.5062 2.2153 4.2480 1.4911 12.0153 1.2489 0.4895 3.3665 26.9311 14.9698 1.0687 1.1590 7.6651 5.9782 1.9208 2.0513 5.5693 17.0018 6.4177 0.9810 2.8364 0.3691 0.7310 11.2158 5.8191 5.3665 8.5653 11.4018 5.3644 5.0125 3.7328 76.3412 56.4630 37.8686 40.1335 11.9955 13.3400 3.9169 3.4397 0.1147 0.2234 4.0704 1.7508 5.0194 6.3434 1.7579 6.3703 0.0910 0.3788 61.3183 25.0489 4.3455 9.7947 187.1443 4.3603 7.6805 140.0201 85.6597 40.5562 31.9218 91.7669 51.8076 55.3469 213.2797 22.8147 56.0934 42.6641 10.8093 12.3798 14.7808 3.6116 5.6607 210.1096 378.6238 50.8170 45.7965 18.5171 7.5055 12.5384 16.9500 35.0198 44.0006 109.9715 98.0166 33.6416 27.2350 12.4567 18.6196 2.2604 1.7082 46.2260 24.1343 4.1616 4.1540 3.8145 1.1366 470.6566 354.5627 3.7872 7.1443 13.6230 35.0243 4.8567 7.8555 4.2276 7.1694 4.1736 10.8775 4.0964 3.6399 19.5885 12.0212 15.4336 15.9026 5.5783 5.2426
temp: 298.150 k
press: 1.00000 atm
elementType: 8 8 8 8 7 7 7 7 6 6 6 6 6 6 6 6 6 6 6 6 6 6 6 6 6 6 6 6 1 1 1 1 1 1 1 1 1 1 1 1 1 1 1 1 1 1
symmnumber: 1
zpe: 918779.7 jmol-1
zpe.correction: 0.349945 hartree
zpe.thermalcorrener: 0.373997 hartree
zpe.thermalcorrenthalpy: 0.374941 hartree
zpe.thermalcorrgfe: 0.293767 hartree
zpe.sumelectzpe: -1290.887842 hartree
zpe.sumelectthermal: -1290.863790 hartree
zpe.sumelectthermalent: -1290.862846 hartree
zpe.sumelectthermalfe: -1290.944019 hartree
dipole: 1.9065 -3.8869 -2.3186
dipole: 4.9111
quadrupole: -167.3322 -147.5919 -161.7272
quadrupole: -2.5855 -6.5166 2.2563
quadrupole: -8.4484 11.2919 -2.8435 -2.5855 -6.5166 2.2563
hfenergy: -1291.2377867 hartree
pointgroup: C01 [X(C20H18N4O4)]
dipole: 0.199419 0.019886 1.9217379 debye
polarizability: 257.4563679|-92.2675146|228.6800071|36.3379104|22.9453346|276.8488525 unknown
InChI: InChI=1S/C20H18N4O4/c1-13-21-15-7-3-5-9-17(15)23(13)19(25)27-11-12-28-20(26)24-14(2)22-16-8-4-6-10-18(16)24/h3-10H,11-12H2,1-2H3
charge 0 multiplicity 1
46 atoms
O  0.92178 1.292839 2.0503
O  -1.84233 0.416638 1.591667
O  0.247106 1.928792 -0.103355
O  -3.191361 2.285623 1.197231
N  2.077727 0.478358 0.229033
N  -2.898821 0.613149 -0.445181
N  3.453246 -0.601353 -1.262238
N  -3.725578 0.40972 -2.578772
C  3.037361 -0.231208 1.018379
C  -2.285372 -0.555597 -0.995827
C  3.876758 -0.886932 0.063035
C  -2.817981 -0.652379 -2.320411
C  2.39695 0.20008 -1.159875
C  -3.764812 1.150545 -1.475044
C  3.255254 -0.35718 2.403743
C  -1.358662 -1.493593 -0.501197
C  1.011564 1.288486 0.651305
C  -2.68855 1.208287 0.806804
C  4.956526 -1.688927 0.482622
C  -2.424088 -1.696449 -3.181295
C  1.616415 0.729889 -2.318384
C  -4.59228 2.383745 -1.308234
C  -0.249134 2.019241 2.611219
C  -1.397202 1.040698 2.863322
C  4.342352 -1.165533 2.811054
C  -0.969515 -2.534171 -1.376763
C  5.180694 -1.8226 1.870007
C  -1.49058 -2.637401 -2.695213
H  2.617481 0.145864 3.130695
H  -0.962225 -1.429445 0.512551
H  5.591448 -2.184062 -0.257711
H  -2.837363 -1.75872 -4.19211
H  0.108673 2.441708 3.56436
H  -0.549723 2.825389 1.921769
H  -2.2426 1.569755 3.338968
H  -1.075566 0.185984 3.477334
H  0.566539 0.387889 -2.289887
H  1.587093 1.83263 -2.32792
H  2.095232 0.361015 -3.23792
H  -3.96537 3.270617 -1.112042
H  -5.162076 2.530741 -2.238146
H  -5.287853 2.301354 -0.45512
H  4.540997 -1.285493 3.881787
H  -0.245422 -3.277319 -1.025631
H  6.012059 -2.439042 2.228233
H  -1.16139 -3.458637 -3.340545
