program: Gaussian 09
title: 000233557
version: EM64L-G09RevD.01
frameworkgroup: C1[X(C11H8O2)]
method: RPBEPBE
basis: SDD
operation: Freq
keyword: #pfreq=noraman
keyword: PBEPBE/SDD
title: #p freq=noraman PBEPBE/SDD
converged: YES YES NO NO
title: Mulliken charges:
elementType: O O C C C C C C C C C C C H H H H H H H H
charge: -0.350856 -0.243867 0.461297 0.506534 -0.495933 -0.423048 -0.392619 -0.410169 0.037216 -0.372873 -0.250075 -0.254469 0.222496 0.242200 0.217309 0.244017 0.240452 0.190976 0.236845 0.236583 0.357985
chargesum: 0.00000
title: Mulliken charges with hydrogens summed into heavy atoms:
elementType: O O C C C C C C C C C C C
charge: 0.007129 -0.243867 0.461297 0.506534 -0.253733 -0.205739 -0.148603 -0.169717 0.037216 -0.181897 -0.013230 -0.017886 0.222496
polarizability: 2.38262645e+02 1.12416199e+00 1.46514964e+02 5.09390405e-03 -5.66882611e-03 4.85773267e+01
1716.lowfreq: -8.9807 -0.0010 -0.0007 0.0004 9.3067 10.9748 50.1996 91.2497 176.1989
frequency: 50.1838 91.2473 176.1974 254.9129 277.6666 325.1680 337.1249 377.2657 378.5055 399.1697 476.1962 499.3322 529.9963 563.0694 569.2363 648.1492 666.8324 735.4719 737.9726 754.6357 769.1665 802.5555 827.4442 869.9155 897.7060 929.6945 951.1895 978.5302 993.8455 1023.6061 1068.5516 1125.9128 1170.1533 1191.0512 1200.3070 1237.3921 1257.4019 1280.5161 1334.1981 1384.9143 1415.4638 1447.1366 1455.2128 1487.0098 1511.9021 1537.1149 1573.9910 1591.8131 1624.0361 3059.2778 3103.9502 3108.6556 3123.2831 3131.6611 3149.3744 3167.7082 3533.3181
redmass: 6.1670 5.3014 4.1911 4.3688 5.3236 7.6359 8.5364 3.1155 8.6959 3.1529 2.6102 1.2678 6.4318 3.1084 5.7119 6.5530 6.3230 7.2806 2.2381 1.5755 2.6702 4.1896 1.4558 1.5683 5.6842 1.5474 1.4357 1.4204 1.3692 2.5665 2.4015 2.1050 1.4469 1.6655 1.6609 1.5284 2.2294 1.9876 1.4464 1.6088 2.0790 3.0909 2.1415 4.1917 6.9970 5.2134 4.8900 7.3885 5.6133 1.0858 1.0876 1.0903 1.0870 1.0875 1.0950 1.1006 1.0654
irintensity: 6.4932 0.1342 0.1853 1.4823 0.8794 11.6523 0.6224 15.2713 0.1401 3.6002 0.9998 125.6060 1.4273 0.8009 17.2574 1.0994 6.7856 15.3673 35.1248 6.5639 13.4500 0.9994 58.0294 20.9119 13.7573 20.8120 0.9078 8.8357 0.4396 0.6397 290.4822 5.4391 1.9083 91.2709 58.9566 18.5882 31.0338 76.1093 6.6925 17.2844 11.5077 14.4330 12.7567 122.8453 52.7156 106.9824 52.6549 56.9935 2.6279 28.5226 6.8412 9.1743 6.3718 0.3166 25.3128 28.8341 77.2701
temp: 298.150 k
press: 1.00000 atm
elementType: 8 8 6 6 6 6 6 6 6 6 6 6 6 1 1 1 1 1 1 1 1
symmnumber: 1
zpe: 413688.4 jmol-1
zpe.correction: 0.157566 hartree
zpe.thermalcorrener: 0.167591 hartree
zpe.thermalcorrenthalpy: 0.168535 hartree
zpe.thermalcorrgfe: 0.121764 hartree
zpe.sumelectzpe: -573.479008 hartree
zpe.sumelectthermal: -573.468983 hartree
zpe.sumelectthermalent: -573.468038 hartree
zpe.sumelectthermalfe: -573.514809 hartree
dipole: -3.8989 5.2534 -0.0016
dipole: 6.5421
quadrupole: -73.6681 -66.4151 -79.4129
quadrupole: 18.8319 0.0011 -0.0143
quadrupole: -0.5027 6.7503 -6.2475 18.8319 0.0011 -0.0143
hfenergy: -573.6365732 hartree
pointgroup: C01 [X(C11H8O2)]
dipole: 1.5300339 2.0631019 -0.1656686 debye
dipolederiv: -1.7796717 0.387948 0.0225387 0.3312601 -0.0412996 -0.0284956 0.0248717 -0.0301253 -0.3625101 -0.9086504 -0.4384439 0.0422296 -0.6932613 -0.6969238 0.0412856 0.0575932 0.0331939 -0.3567907 0.3533265 0.154884 -0.0175528 -0.0702604 0.0874146 0.0000873 -0.0047246 -0.0067878 0.0576971 -0.023138 0.2186124 -0.0102649 0.0644449 -0.3576864 0.0217662 -0.0017361 0.0175597 0.0477964 -0.3983415 -0.4663634 0.0353801 0.1052413 0.1771214 -0.0200265 0.0032258 -0.0033634 -0.1261532 0.1835074 -0.2635253 0.0060111 0.0792675 0.1699723 -0.0193183 -0.0140738 -0.0088432 -0.112645 -0.2538979 -0.0749558 0.0071585 -0.0323496 0.120946 -0.0154797 0.0042575 -0.0140155 -0.1633105 -0.0401425 -0.1271384 0.0038401 0.1367195 0.1085948 -0.0198465 -0.0116911 -0.0118283 -0.1631884 0.7627076 0.6677266 -0.0589864 0.9551188 0.4762571 -0.0512464 -0.0759504 -0.0413697 0.1112753 -0.2691407 0.1875756 -0.0068846 -0.4088426 0.2460414 -0.0114528 0.0278936 -0.0300763 -0.1624735 0.1064766 -0.1015067 -0.0014086 -0.0253363 0.2316191 -0.0212783 -0.0056432 -0.0193259 -0.1442552 -0.0096482 0.2251821 -0.0173416 -0.0080025 -0.0976297 -0.0033616 -0.0038021 -0.0102266 -0.1601917 1.7498463 -0.3330195 -0.0334138 -0.4340531 -0.2266965 0.0323881 -0.0271721 0.0289509 0.1042044 0.0577547 0.0295635 0.0005454 0.0069665 -0.0379022 0.0093034 0.0017985 0.009072 0.1307381 0.0511742 -0.0826042 0.007466 -0.0389857 -0.0753254 0.0139104 0.0049177 0.0149487 0.1378734 0.0696712 -0.0725727 0.0066227 0.0212256 -0.0699094 0.012404 0.0011741 0.015065 0.1537172 0.0695083 0.0329786 0.0005711 -0.0672493 -0.095572 0.0165461 0.0063712 0.0134988 0.1541187 -0.0520891 0.1242781 -0.0011527 0.1064202 -0.0712416 0.0100249 0.0002353 0.0094637 0.1503416 -0.0537963 0.1040676 0.0002285 0.1104776 0.0139383 0.0054441 -0.0001223 0.0056877 0.1622178 -0.0934887 -0.0754218 0.0119416 -0.0761785 0.0569793 0.008585 0.0118907 0.0085703 0.1652513 0.4780321 -0.0972647 0.002472 -0.0626227 0.0813023 0.0187605 0.0006865 0.0199514 0.376287 unknown
polarizability: 238.0939447|-1.3095896|146.1855873|-5.6428872|-5.6367099|49.0754042 unknown
InChI: InChI=1S/C11H8O2/c12-10-6-5-8-3-1-2-4-9(8)7-11(10)13/h1-7,12H
charge 0 multiplicity 1
21 atoms
O  -3.661426 0.613687 0.136922
O  -2.781003 -1.865036 0.251556
C  0.758697 -0.637318 0.071665
C  0.960586 0.814807 -0.018834
C  -0.469398 -1.327416 0.146918
C  -0.076505 1.775747 -0.044713
C  1.953584 -1.47091 0.085483
C  2.316289 1.320248 -0.087813
C  -1.878593 -0.955737 0.170035
C  -1.48134 1.629667 0.006529
C  3.232089 -0.942162 0.017599
C  3.421338 0.482951 -0.071028
C  -2.281807 0.479786 0.10038
H  -0.38362 -2.422636 0.206097
H  0.263749 2.81812 -0.116596
H  1.813379 -2.55583 0.152347
H  2.453874 2.406119 -0.154754
H  -2.034494 2.582797 -0.033836
H  4.103395 -1.605505 0.031048
H  4.433552 0.896648 -0.124463
H  -3.936846 1.566772 0.091956
