program: Gaussian 09
title: 000233585
version: EM64L-G09RevD.01
frameworkgroup: C1[X(C17H16BrNO)]
method: RPBEPBE
basis: SDD
operation: Freq
keyword: #p
keyword: freq=noraman
keyword: PBEPBE/SDD
title: #p freq=noraman PBEPBE/SDD
converged: YES YES NO NO
title: Mulliken charges:
elementType: Br O N C C C C C C C C C C C C C C C C C H H H H H H H H H H H H H H H H
charge: 0.027773 -0.211718 -0.207290 -0.383325 -0.420577 -0.537895 0.294600 0.331166 -0.508112 -0.387442 -0.403658 0.096007 -0.261472 -0.273470 0.319372 -0.345904 -0.320214 -0.193985 -0.210754 -0.210951 0.239486 0.219071 0.207471 0.225352 0.229309 0.220686 0.235261 0.255308 0.219481 0.228570 0.223664 0.227406 0.284103 0.277771 0.256199 0.258712
chargesum: 0.00000
title: Mulliken charges with hydrogens summed into heavy atoms:
elementType: Br O N C C C C C C C C C C C C C C C C C
charge: 0.027773 -0.211718 -0.207290 0.075232 0.012245 -0.087901 0.294600 0.331166 -0.017544 -0.167960 -0.175088 0.096007 -0.037808 -0.046064 0.319372 -0.061801 -0.042443 0.062214 0.047958 -0.210951
polarizability: 2.59897510e+02 7.83979385e+00 2.41058831e+02 6.08950192e+00 7.60829971e+00 1.49841987e+02
1716.lowfreq: -16.2642 -5.6619 -3.4423 -0.0005 -0.0004 0.0003 10.2209 15.7573 36.2876
frequency: -13.1113 15.7059 36.2513 57.2893 72.3139 102.4555 113.6684 133.1550 182.9618 225.6629 247.4088 256.8480 268.8689 302.9277 320.5689 386.9872 401.3386 406.0873 415.3398 446.2874 470.4297 474.9682 497.8485 533.6930 539.2814 586.4071 602.1123 620.6304 665.1103 703.5971 714.3311 730.0855 743.9617 749.2441 795.5149 828.0034 841.1548 848.1803 865.6768 870.6369 919.4346 932.0798 958.4728 966.3601 977.1480 992.3349 995.5064 1015.6490 1034.2847 1049.0304 1061.4171 1065.0447 1079.6666 1114.4452 1119.5163 1157.1239 1175.2772 1177.0505 1190.2910 1200.1087 1221.6023 1226.8280 1260.1478 1280.8880 1295.8344 1298.8857 1326.5783 1331.8941 1339.1818 1353.9869 1367.2782 1379.2876 1393.9202 1400.0171 1447.5380 1456.8239 1458.9257 1466.1897 1470.8176 1484.2848 1509.0589 1550.2667 1579.3836 1582.2706 1593.8998 1614.9240 2921.1680 2961.4286 2972.7579 3002.5381 3032.8346 3046.7813 3067.3060 3084.6555 3112.2643 3125.1269 3144.5550 3151.7929 3155.2942 3164.5084 3172.0590 3175.7765
redmass: 4.2331 5.2271 5.3094 3.6316 9.9125 4.8443 3.5035 4.2312 4.4335 8.3492 6.2652 6.7518 3.4414 2.9533 2.2543 3.2418 4.1377 2.9102 3.0801 3.4023 4.0258 4.2325 5.2221 4.1812 3.2746 3.9687 2.9163 6.9759 4.6222 4.2958 2.2670 5.4001 2.6386 1.9527 3.4658 1.4044 1.3071 1.5452 1.9004 1.7258 2.4910 1.3667 2.1659 1.3581 1.3974 4.8939 1.3931 3.0239 3.9198 2.6359 2.2869 2.0200 1.7855 1.4546 1.9905 1.6389 1.1730 1.3547 1.1516 1.3938 2.0151 1.8698 1.6338 2.0984 1.3861 1.2613 1.2724 1.6493 1.6568 1.4349 5.0234 6.0592 3.9367 1.6501 2.1988 1.1535 1.1342 1.1224 2.2713 1.3329 1.9214 8.1481 6.4815 6.8603 7.0918 6.3459 1.0707 1.0660 1.0686 1.0621 1.0933 1.0908 1.1040 1.0915 1.0880 1.0860 1.0920 1.0886 1.0892 1.1000 1.0963 1.0975
irintensity: 0.9322 0.3577 0.7049 0.1837 1.8418 2.5334 0.6637 1.5943 7.2883 1.2192 1.4497 1.9276 5.0751 5.5005 13.3138 6.4122 2.7520 0.0682 1.5403 6.5238 11.1451 9.0764 11.8182 12.3326 6.9085 3.5180 14.0736 0.1601 3.8352 8.6622 11.3315 24.4328 90.0038 23.3910 16.0134 6.0551 3.2628 30.4559 13.1852 17.7976 2.1675 2.0638 7.8753 1.4443 2.3202 61.5310 1.6113 7.7207 1.5144 10.3530 46.0453 11.8433 2.4395 7.0869 14.4321 20.9020 3.9326 4.8105 19.4264 13.8141 19.3656 64.7099 41.7938 157.2053 0.8064 0.3933 3.6882 54.5767 5.8803 1.4151 15.5418 11.5087 14.4650 4.3932 25.6430 5.2095 14.4257 12.7021 22.0322 19.7510 107.4850 168.6651 7.2917 137.0728 75.3763 81.1611 78.3689 39.4607 46.5389 22.3756 30.7531 23.1399 49.7547 11.4269 19.0590 10.7575 37.8752 0.2994 6.7915 23.1760 2.8771 6.5705
temp: 298.150 k
press: 1.00000 atm
elementType: 35 8 7 6 6 6 6 6 6 6 6 6 6 6 6 6 6 6 6 6 1 1 1 1 1 1 1 1 1 1 1 1 1 1 1 1
symmnumber: 1
zpe: 749070.4 jmol-1
zpe.correction: 0.285306 hartree
zpe.thermalcorrener: 0.301930 hartree
zpe.thermalcorrenthalpy: 0.302874 hartree
zpe.thermalcorrgfe: 0.238626 hartree
zpe.sumelectzpe: -799.419184 hartree
zpe.sumelectthermal: -799.402560 hartree
zpe.sumelectthermalent: -799.401616 hartree
zpe.sumelectthermalfe: -799.465864 hartree
dipole: -1.3147 -0.8133 0.7541
dipole: 1.7201
quadrupole: -126.3771 -133.7508 -121.1109
quadrupole: 1.7152 -4.1863 4.1021
quadrupole: 0.7025 -6.6712 5.9687 1.7152 -4.1863 4.1021
hfenergy: -799.7044902 hartree
pointgroup: C01 [X(C17H16Br1N1O1)]
dipole: -0.598588 0.1510927 -0.2771605 debye
polarizability: 255.0744138|-14.8853125|230.6265772|-22.8588868|-26.6894195|165.0973377 unknown
InChI: InChI=1S/C17H16BrNO/c18-15-9-7-14(8-10-15)17(20)12-19-11-3-5-13-4-1-2-6-16(13)19/h1-2,4,6-10H,3,5,11-12H2
charge 0 multiplicity 1
36 atoms
Br 5.031867 1.22286 -2.063017
O  1.098121 -2.933667 1.924543
N  -1.389072 -0.834464 0.813805
C  -1.897103 -2.036868 0.114084
C  -2.277229 -1.712301 -1.339445
C  -3.353473 -0.60936 -1.350548
C  -1.996183 0.421631 0.587213
C  -2.951843 0.574947 -0.477544
C  -0.507301 -1.114843 1.952612
C  -1.677246 1.572929 1.371838
C  -3.529984 1.840648 -0.710307
C  0.829914 -1.762164 1.52005
C  -2.281036 2.822352 1.121571
C  -3.21501 2.9724 0.074368
C  1.785805 -1.013751 0.64059
C  2.993406 -1.667155 0.268107
C  1.556954 0.315502 0.192069
C  3.955759 -1.018244 -0.527798
C  2.513219 0.979593 -0.604721
C  3.701554 0.304194 -0.955314
H  -1.110764 -2.811816 0.141875
H  -2.781736 -2.447987 0.651903
H  -2.650472 -2.627281 -1.834897
H  -1.375238 -1.376012 -1.884205
H  -3.544585 -0.26291 -2.383235
H  -4.309994 -1.036229 -0.983413
H  -0.295046 -0.194545 2.518453
H  -0.979067 -1.832608 2.654621
H  -0.972868 1.509697 2.207456
H  -4.249732 1.935986 -1.533871
H  -2.015028 3.677939 1.752863
H  -3.682671 3.941127 -0.127681
H  3.159564 -2.690057 0.621676
H  0.63299 0.843735 0.443145
H  4.883506 -1.524483 -0.808586
H  2.332725 2.001605 -0.949062
