program: Gaussian 09
title: 000233570
version: EM64L-G09RevD.01
frameworkgroup: C1[X(C14H18N2O4)]
method: RPBEPBE
basis: SDD
operation: Freq
keyword: #p
keyword: freq=noraman
keyword: PBEPBE/SDD
title: #p freq=noraman PBEPBE/SDD
converged: YES YES NO NO
title: Mulliken charges:
elementType: O O O O N N C C C C C C C C C C C C C C H H H H H H H H H H H H H H H H H H
charge: -0.233940 -0.233950 -0.278812 -0.278938 -0.153450 -0.153442 -0.413141 -0.399352 -0.413245 -0.399356 0.423988 0.423712 -0.296484 -0.297756 -0.296503 -0.297748 0.043898 0.043762 -0.518313 -0.518347 0.311228 0.224107 0.246655 0.233348 0.224093 0.311347 0.233362 0.246637 0.228802 0.203439 0.209661 0.226701 0.203415 0.228786 0.226689 0.209649 0.239710 0.239790
chargesum: 0.00000
title: Mulliken charges with hydrogens summed into heavy atoms:
elementType: O O O O N N C C C C C C C C C C C C C C
charge: -0.233940 -0.233950 -0.278812 -0.278938 -0.153450 -0.153442 0.122193 0.080650 0.122194 0.080643 0.423988 0.423712 0.135757 0.138606 0.135699 0.138591 0.043898 0.043762 -0.278603 -0.278557
polarizability: 3.37302504e+02 3.28184403e+01 1.80960997e+02 -1.77691263e+01 -2.03760395e+00 1.12036466e+02
1716.lowfreq: -12.1858 -0.0006 -0.0006 0.0001 7.8020 10.4710 10.8212 34.2329 36.8623
frequency: 10.7689 34.2326 36.4657 52.8840 62.4237 119.0253 136.4056 149.4701 170.0431 229.3887 249.3845 287.8992 292.0310 306.4182 351.6717 366.4129 398.9585 417.1026 425.4893 438.7773 448.7334 452.0314 457.5849 487.8088 493.2947 517.6685 579.0983 590.1583 636.8271 640.4589 681.4375 730.1442 733.6117 788.2571 789.2924 799.1731 827.8141 831.2242 835.5214 840.8739 847.7527 890.5172 895.6111 909.8471 988.1828 993.7490 1019.0988 1022.6455 1043.5759 1043.8799 1064.7563 1064.8380 1100.1044 1103.9290 1122.7873 1136.1384 1185.1923 1187.1977 1205.4864 1207.7090 1238.3912 1241.2499 1255.0201 1266.5452 1270.6974 1279.0978 1319.2894 1319.9816 1326.4557 1331.1481 1335.8379 1339.0810 1341.5998 1355.9320 1358.8931 1359.3240 1406.4926 1428.9756 1446.8130 1446.8351 1454.6420 1454.6728 1463.1230 1467.6133 1477.1420 1480.2378 1499.1092 1534.3476 1567.2845 1602.9996 2956.7720 2956.8186 2960.5140 2960.6429 2998.6641 2999.0337 3006.5285 3006.8681 3085.1450 3085.1757 3089.7124 3089.9235 3099.4511 3100.1593 3110.1081 3110.3018 3169.0706 3171.8154
redmass: 6.0045 4.1918 5.3623 4.7436 5.5470 4.2334 4.6621 6.2848 3.0170 2.5903 4.7951 5.5613 2.8163 3.1072 5.4483 2.3973 4.4380 2.6610 8.9737 2.7227 3.0501 2.6289 4.4083 2.4172 6.8622 3.9926 2.5606 2.6659 3.2218 2.8303 4.6355 1.6733 6.8619 4.3883 4.3022 4.4012 1.7431 1.7926 1.6681 3.4883 3.2162 2.5253 2.3740 2.7485 2.8482 2.7462 2.2648 2.2485 3.0648 3.0749 2.6155 2.6309 2.1757 2.2427 4.7509 4.4299 1.1256 1.0815 1.6158 1.5575 1.3354 1.2926 1.3551 1.2224 1.2249 3.1047 1.3243 1.2509 1.3574 1.2566 1.2794 1.3034 1.2787 3.1639 1.2995 1.4877 3.1788 3.7799 1.0833 1.0831 1.1003 1.0993 1.1618 1.0789 1.1521 1.1376 4.5253 6.2204 6.6012 5.7541 1.0676 1.0676 1.0674 1.0674 1.0647 1.0649 1.0668 1.0669 1.0972 1.0971 1.0973 1.0974 1.1003 1.1003 1.0958 1.0958 1.0884 1.0890
irintensity: 0.9598 0.0938 0.0000 0.0041 8.3036 3.2467 0.0000 0.2042 0.0000 6.8897 0.0000 0.0070 33.8000 0.0001 9.8051 0.0001 0.8753 18.7653 0.0000 0.0003 0.0003 1.8127 42.8854 1.3673 0.0001 0.0001 22.5953 0.0000 0.0005 9.8767 0.0000 0.0000 6.5809 0.0010 61.7288 9.2574 55.0946 0.0002 34.3095 0.0000 0.0001 40.1883 0.0001 79.1086 0.0001 7.8039 0.0017 76.0687 0.1609 100.9009 17.1235 0.3034 0.0000 1.7514 20.6859 0.0000 73.4352 0.0030 404.4827 0.0199 4.8524 0.0006 0.0002 74.4223 0.0014 100.4272 46.5291 0.0085 9.4317 0.0001 7.1480 0.0006 22.4535 0.0001 16.1999 0.0188 0.0002 34.6355 7.2149 0.4905 18.5442 8.9750 0.0012 29.4519 60.1914 0.0016 0.0021 544.5407 688.4152 0.0000 0.4167 67.4282 95.4609 0.0597 134.8628 0.7660 138.7561 0.2563 67.3264 1.8552 105.6790 0.0400 7.4269 88.7095 6.2578 9.8179 20.9076 0.0081
temp: 298.150 k
press: 1.00000 atm
elementType: 8 8 8 8 7 7 6 6 6 6 6 6 6 6 6 6 6 6 6 6 1 1 1 1 1 1 1 1 1 1 1 1 1 1 1 1 1 1
symmnumber: 1
zpe: 809601.5 jmol-1
zpe.correction: 0.308361 hartree
zpe.thermalcorrener: 0.326071 hartree
zpe.thermalcorrenthalpy: 0.327015 hartree
zpe.thermalcorrgfe: 0.260368 hartree
zpe.sumelectzpe: -953.117834 hartree
zpe.sumelectthermal: -953.100125 hartree
zpe.sumelectthermalent: -953.099181 hartree
zpe.sumelectthermalfe: -953.165828 hartree
dipole: 0.0029 -0.0005 0.0003
dipole: 0.0030
quadrupole: -120.1178 -123.7043 -116.2966
quadrupole: -7.3296 -6.7969 5.4734
quadrupole: -0.0782 -3.6647 3.7430 -7.3296 -6.7969 5.4734
hfenergy: -953.4261954 hartree
pointgroup: C01 [X(C14H18N2O4)]
dipole: -0.001154 0.0001381 0.0001892 debye
polarizability: 335.9598347|15.402252|161.1705204|38.1774192|30.8004591|133.1696124 unknown
InChI: InChI=1S/C14H18N2O4/c17-13-10-12(16-3-7-20-8-4-16)14(18)9-11(13)15-1-5-19-6-2-15/h9-10H,1-8H2
charge 0 multiplicity 1
38 atoms
O  -5.476141 0.085023 0.393509
O  5.476199 -0.08365 -0.392906
O  -1.155585 -1.974291 -1.536185
O  1.155925 1.973141 1.535375
N  -2.776853 0.286698 -0.6504
N  2.776792 -0.287202 0.650161
C  -3.683694 -0.802277 -1.110941
C  -3.568003 1.494566 -0.308906
C  3.682613 0.802538 1.110803
C  3.568944 -1.494571 0.309175
C  -1.446348 0.147938 -0.303045
C  1.446317 -0.149033 0.302519
C  -4.70524 -1.111738 0.005855
C  -4.571744 1.162702 0.820108
C  4.704256 1.112596 -0.00574
C  4.572798 -1.162149 -0.819572
C  -0.636546 -1.054909 -0.797457
C  0.636655 1.053922 0.796606
C  -0.760043 1.111768 0.44508
C  0.760103 -1.112831 -0.445744
H  -3.089423 -1.686503 -1.380798
H  -4.221185 -0.441019 -2.008908
H  -4.140407 1.781356 -1.212022
H  -2.919349 2.338774 -0.035918
H  4.220076 0.441895 2.009032
H  3.087502 1.686335 1.380276
H  2.921083 -2.339372 0.036197
H  4.1413 -1.780694 1.212532
H  -5.454704 -1.838552 -0.347002
H  -4.177983 -1.52395 0.893067
H  -4.02487 0.866909 1.741055
H  -5.221031 2.026274 1.038887
H  4.176952 1.524221 -0.893197
H  5.453039 1.840066 0.34721
H  5.222845 -2.025251 -1.037946
H  4.025994 -0.866996 -1.740766
H  -1.263145 1.986054 0.865149
H  1.263209 -1.987087 -0.865844
