program: Gaussian 09
title: 000233558
version: EM64L-G09RevD.01
frameworkgroup: C1[X(C12H10O2)]
method: RPBEPBE
basis: SDD
operation: Freq
keyword: #pfreq=noraman
keyword: PBEPBE/SDD
title: #p freq=noraman PBEPBE/SDD
converged: YES YES NO NO
title: Mulliken charges:
elementType: O O C C C C C C C C C C C C H H H H H H H H H H
charge: -0.286824 -0.258411 0.441649 0.447759 -0.508661 -0.402102 -0.382468 -0.414155 0.230120 -0.281492 0.062358 -0.249120 -0.251484 -0.509621 0.239833 0.213129 0.240760 0.241226 0.233852 0.236490 0.237073 0.216605 0.277483 0.226000
chargesum: 0.00000
title: Mulliken charges with hydrogens summed into heavy atoms:
elementType: O O C C C C C C C C C C C C
charge: -0.286824 -0.258411 0.441649 0.447759 -0.268828 -0.161342 -0.169338 -0.172929 0.230120 -0.047640 0.062358 -0.012630 -0.014411 0.210466
polarizability: 2.61159860e+02 1.08435765e+01 1.44307091e+02 -2.48735617e+00 2.83846884e+00 5.90998173e+01
1716.lowfreq: -8.6408 -3.5307 0.0001 0.0004 0.0007 5.8121 48.1584 54.2452 86.6360
frequency: 48.1148 54.1980 86.6225 139.9100 172.1451 228.6600 279.1152 319.9354 330.2868 341.8986 361.7854 371.9300 423.1785 500.9080 521.8744 570.5685 585.1675 631.5513 685.7707 714.0193 747.4783 764.8706 778.3238 779.8354 850.9873 879.6166 887.1590 930.8432 945.9703 966.2600 993.2794 1012.6348 1044.1808 1089.0679 1102.1573 1121.1778 1153.0807 1173.7567 1184.4340 1237.3855 1259.2450 1282.2628 1302.7372 1387.2790 1405.8403 1411.7895 1425.2083 1441.0025 1451.8621 1471.8546 1482.9314 1511.2419 1547.0073 1603.3717 1609.7541 1627.8139 2994.7273 3089.1246 3104.0296 3106.6577 3123.9800 3126.6358 3129.7678 3146.3743 3147.7813 3167.9893
redmass: 4.4613 2.3647 2.3061 2.1482 3.8142 3.5955 5.0950 5.3724 5.6468 3.7269 6.2648 5.0718 3.2649 3.8077 6.3017 3.0904 5.6374 6.3057 6.1033 2.4133 5.1180 1.3966 4.4100 3.6701 1.6050 5.9312 1.5833 1.5241 5.8348 1.4115 1.3604 1.3437 2.4269 3.3515 1.2322 1.9504 1.5564 1.5484 1.2327 1.9632 1.8354 1.8133 1.9289 1.9249 1.7001 3.1451 1.3501 2.4885 1.0933 1.1121 2.2132 4.7024 7.1188 6.2948 5.7840 7.2944 1.0328 1.0859 1.0997 1.0872 1.0875 1.0911 1.0890 1.1048 1.0938 1.1006
irintensity: 5.6019 6.0866 0.5119 6.2658 2.8644 3.0876 3.3786 1.6254 5.8943 5.7215 1.3184 0.8062 6.3998 12.8950 4.6228 0.9061 10.7759 12.1486 1.6494 1.9839 5.8311 59.6686 0.7634 3.0551 23.7560 6.6388 34.0345 11.4544 8.6548 13.1336 0.5674 0.5428 11.3408 100.6610 9.0714 29.7831 35.4621 64.3885 50.5398 87.6870 53.0171 11.4175 22.7981 8.9971 8.0152 1.2908 100.4932 31.0261 15.6901 53.8212 13.7240 205.5313 28.4651 37.9922 6.5791 65.5068 87.9636 9.9811 42.5214 3.2231 4.2338 17.1178 0.8806 6.9818 22.5740 29.7515
temp: 298.150 k
press: 1.00000 atm
elementType: 8 8 6 6 6 6 6 6 6 6 6 6 6 6 1 1 1 1 1 1 1 1 1 1
symmnumber: 1
zpe: 486691.2 jmol-1
zpe.correction: 0.185371 hartree
zpe.thermalcorrener: 0.197153 hartree
zpe.thermalcorrenthalpy: 0.198097 hartree
zpe.thermalcorrgfe: 0.146867 hartree
zpe.sumelectzpe: -612.708696 hartree
zpe.sumelectthermal: -612.696914 hartree
zpe.sumelectthermalent: -612.695970 hartree
zpe.sumelectthermalfe: -612.747200 hartree
dipole: -3.4235 -0.8526 1.4789
dipole: 3.8255
quadrupole: -73.6967 -74.4602 -85.5854
quadrupole: -6.3364 5.0326 1.1439
quadrupole: 4.2174 3.4539 -7.6713 -6.3364 5.0326 1.1439
hfenergy: -612.8940672 hartree
pointgroup: C01 [X(C12H10O2)]
dipole: -1.404127 -0.3581946 0.4065924 debye
dipolederiv: -1.6802231 0.4856765 -0.1777375 0.8830393 -0.5876378 0.1230767 0.1734294 -0.0575605 -0.3122164 -1.3635064 -0.2515269 -0.0087066 -0.2474374 -0.4995361 0.0117077 0.0113698 0.0252669 -0.3506831 0.3083235 -0.2290424 0.0147254 0.0836782 0.0325208 -0.0038187 0.0470372 -0.0197152 0.0433609 -0.1245963 -0.0617951 -0.006391 -0.0835121 -0.2724514 -0.0481908 -0.0335531 -0.0925 0.0318196 -0.3206865 0.3998191 -0.0099816 -0.1235056 0.1375139 0.0479713 -0.1403386 0.100875 -0.1344478 -0.2621346 0.0328783 -0.0263945 -0.024351 0.1348167 0.056173 -0.0106204 0.0620309 -0.1523066 0.3373876 0.1345967 0.0157908 0.1453084 0.2947934 0.0905956 0.0257458 0.1186021 -0.0831323 0.0016471 0.0808228 0.0131658 -0.1458732 0.1164057 0.0480057 -0.0222746 0.0638202 -0.1469489 1.0572901 -0.6680239 0.0403676 -1.2770907 0.1685517 -0.1546965 -0.2436572 -0.0012093 0.0413351 -0.436319 -0.0541428 0.0166271 0.2934194 0.1079424 0.0402659 0.0655713 0.0145537 -0.1460868 1.3520446 0.2817331 -0.0666797 0.4460411 0.37085 0.055013 0.0220786 -0.0097642 0.16927 0.0696082 0.007992 0.0382253 0.066798 0.1333646 0.0525631 0.0400484 0.0634808 -0.1259095 0.0121291 -0.0999694 -0.0041572 -0.0532801 -0.1811315 0.0116616 0.0052986 -0.0139601 -0.1575988 0.9351556 -0.2391673 0.1632134 -0.026113 0.2295707 -0.0118015 0.2382629 -0.0675673 0.3550987 0.078793 -0.0277303 -0.0076744 0.0381533 -0.0581432 -0.0248753 0.0000694 -0.0223135 0.1312611 0.0242231 0.1171972 0.022742 0.0472567 -0.0667864 -0.0460605 0.0023406 -0.0345428 0.1176014 0.0673929 0.0861381 0.0112155 0.0172255 -0.0695623 -0.047102 -0.0065646 -0.0404048 0.1426008 0.074301 0.0043352 -0.0058731 0.0795834 -0.084257 -0.0479226 0.0113357 -0.0533265 0.1421606 0.0323488 -0.0636707 -0.012149 -0.0312036 -0.0413181 -0.0447198 0.0211043 -0.0300365 0.1390086 -0.0247977 -0.0960827 -0.0379277 -0.1130524 0.0013814 -0.0460062 -0.0427863 -0.0422184 0.1474245 -0.113965 0.0485122 -0.0123497 0.0595493 0.079814 -0.0140567 -0.0107217 -0.0150863 0.1609747 -0.0536729 0.0523706 0.0532789 -0.0413568 0.0888507 -0.0694618 -0.1029071 0.0124871 -0.1650812 0.0330012 -0.0245502 0.01015 -0.1944408 0.0738578 0.0274215 -0.0140097 0.0551449 0.0541585 -0.0037442 0.08363 -0.0234796 0.2011641 -0.1094101 -0.0057427 -0.0362588 -0.0160562 0.098337 unknown
polarizability: 260.3218751|5.0269996|141.2557322|17.4360682|14.8084794|62.9891613 unknown
InChI: InChI=1S/C12H10O2/c1-14-12-8-10-5-3-2-4-9(10)6-7-11(12)13/h2-8H,1H3
charge 0 multiplicity 1
24 atoms
O  2.584315 -1.549281 0.071729
O  3.138094 1.22698 0.209258
C  -1.034532 -0.620823 -0.057961
C  -1.417046 0.745856 0.216031
C  0.30583 -1.159308 -0.026452
C  -2.077883 -1.561317 -0.35564
C  -0.49153 1.815395 0.533381
C  -2.805659 1.091701 0.18065
C  1.563985 -0.599831 0.165157
C  0.885992 1.851602 0.588686
C  1.916449 0.842423 0.31687
C  -3.427964 -1.192823 -0.391483
C  -3.800714 0.15258 -0.118593
C  3.87291 -1.386176 0.786264
H  0.362122 -2.244513 -0.192112
H  -0.983791 2.775834 0.745993
H  -1.79557 -2.600059 -0.562523
H  -3.086504 2.130107 0.393253
H  1.345551 2.824389 0.810822
H  -4.19392 -1.939113 -0.627252
H  -4.85405 0.450007 -0.141361
H  3.698973 -1.149802 1.85192
H  4.476873 -0.591625 0.327283
H  4.349766 -2.374003 0.69078
