program: Gaussian 09
title: 000233551
version: EM64L-G09RevD.01
frameworkgroup: C1[X(C10H10N2O)]
method: RPBEPBE
basis: SDD
operation: Freq
keyword: #p
keyword: freq=noraman
keyword: PBEPBE/SDD
title: #p freq=noraman PBEPBE/SDD
converged: YES YES NO NO
title: Mulliken charges:
elementType: O N N C C C C C C C C C C H H H H H H H H H H
charge: -0.247932 -0.461588 -0.066408 0.179183 0.280661 -0.009836 -0.601244 -0.372018 -0.347139 0.279804 -0.215908 -0.234131 -0.767471 0.272659 0.271451 0.357944 0.235357 0.246221 0.222122 0.223365 0.261016 0.252522 0.241372
chargesum: 0.00000
title: Mulliken charges with hydrogens summed into heavy atoms:
elementType: O N N C C C C C C C C C C
charge: -0.247932 -0.103644 -0.066408 0.179183 0.280661 -0.009836 -0.057134 -0.136661 -0.100919 0.279804 0.006214 -0.010766 -0.012562
polarizability: 1.86010726e+02 -7.86504977e+00 1.20868804e+02 -3.02631343e+00 -9.84193054e-01 5.94577686e+01
1716.lowfreq: -7.2716 -3.5358 -0.0004 -0.0002 0.0001 8.3034 32.1731 68.4262 107.2290
frequency: 32.1580 68.4244 107.2287 121.1999 151.6580 254.1834 268.6629 300.4253 308.1488 427.4199 451.7600 458.3085 509.4727 582.1504 587.3244 615.4452 646.7315 718.6883 753.6978 771.0162 784.6247 808.6262 830.4476 857.8646 860.6276 888.0300 937.5715 967.3946 975.8367 981.3436 1008.8344 1030.8976 1110.0747 1157.7849 1162.6468 1183.6771 1194.9596 1221.0915 1261.8543 1306.1817 1315.7890 1375.0707 1377.3384 1407.6663 1421.6928 1440.7890 1442.3539 1455.7717 1474.9559 1520.2011 1590.8822 1619.3579 1637.3174 2952.9816 2983.5353 3042.6963 3070.8926 3124.6624 3129.0732 3142.4072 3157.2459 3170.0866 3498.0011
redmass: 3.0100 4.3799 1.6003 2.5236 2.5895 5.1415 5.6849 3.2587 4.3235 2.6357 2.5066 5.2634 4.4646 3.7538 5.1809 6.6448 4.6503 4.7232 1.2877 2.9000 1.4168 2.9076 2.1014 1.8700 1.9948 4.8300 1.3821 2.6159 1.3018 2.7552 2.1721 1.8036 1.6216 1.2155 1.8298 1.2695 1.8170 1.8815 2.7567 1.9391 2.9321 1.8212 1.8711 2.7156 1.1535 3.3315 1.1034 1.0631 3.4243 5.4930 7.1142 7.4590 7.3477 1.0693 1.0391 1.0877 1.0938 1.1010 1.0852 1.0902 1.0959 1.0994 1.0828
irintensity: 0.8301 8.4436 2.3212 6.8740 6.5693 3.6782 4.2324 1.7764 0.5369 5.9107 2.4430 6.5288 15.6508 0.4353 9.7875 0.2928 0.9238 9.1029 66.2873 14.5302 100.7629 25.3992 3.4921 2.8962 3.6024 3.2843 4.9762 13.5156 0.0107 7.8685 6.0881 12.9816 4.3759 6.9900 103.7924 25.1977 46.1047 11.3852 40.0410 20.1594 22.1108 45.2127 106.3906 13.9618 11.9639 40.1121 19.6963 18.4285 0.9337 99.7928 6.5389 61.2208 24.9890 22.4154 1.5246 4.8698 10.2300 10.0432 0.8228 11.3313 26.2677 22.6419 228.3909
temp: 298.150 k
press: 1.00000 atm
elementType: 8 7 7 6 6 6 6 6 6 6 6 6 6 1 1 1 1 1 1 1 1 1 1
symmnumber: 1
zpe: 472616.1 jmol-1
zpe.correction: 0.180010 hartree
zpe.thermalcorrener: 0.191134 hartree
zpe.thermalcorrenthalpy: 0.192078 hartree
zpe.thermalcorrgfe: 0.142030 hartree
zpe.sumelectzpe: -570.882745 hartree
zpe.sumelectthermal: -570.871621 hartree
zpe.sumelectthermalent: -570.870677 hartree
zpe.sumelectthermalfe: -570.920725 hartree
dipole: 3.2847 0.3554 -0.1277
dipole: 3.3064
quadrupole: -56.9958 -77.9454 -78.0780
quadrupole: -8.5051 -0.3606 -0.4705
quadrupole: 14.0106 -6.9390 -7.0716 -8.5051 -0.3606 -0.4705
hfenergy: -571.0627553 hartree
pointgroup: C01 [X(C10H10N2O1)]
dipole: 1.2721691 -0.2715228 -0.0025924 debye
dipolederiv: -0.8314126 -0.0829832 -0.0300137 -0.0668468 -0.6953798 -0.228439 0.0130995 -0.2294467 -0.4359725 -0.7275709 -0.0529 -0.0791566 0.2861445 -0.5093424 -0.0931909 0.0537086 -0.1164541 -0.2893333 -0.6795421 0.1536367 0.0301255 0.0905462 -0.4001529 -0.0485676 -0.0280153 -0.0425496 -0.2862665 0.4437536 -0.0596873 0.0287434 -0.1412924 0.5538421 0.2136666 0.1181192 0.2533051 0.1607809 0.3820478 -0.0354421 0.032123 -0.3287283 -0.0488337 -0.1042677 -0.1313881 -0.062031 0.0158382 0.2708414 -0.0023663 0.0387903 0.2675356 -0.0213637 0.0215461 0.1633508 -0.0160941 0.0174258 -0.1853501 0.0996746 0.109327 0.2129518 -0.0967178 -0.1795148 0.2043128 -0.2388949 -0.0840708 0.0417222 0.0430984 0.0512575 0.0265696 0.0165426 0.1018062 0.0513913 0.1064109 -0.1288927 0.0895565 -0.0110891 0.0274964 -0.0551428 0.068977 0.106429 0.010142 0.1107105 -0.1005084 1.2538748 0.0498297 -0.1414723 -0.0767908 0.7268903 0.3771731 -0.3045331 0.3872722 0.3862939 -0.0931397 0.00594 0.0183474 0.1089645 0.0218475 0.1144285 0.0667909 0.1006171 -0.12157 -0.0265107 -0.0774968 -0.0135935 -0.1865968 -0.0740283 0.0320736 -0.0691784 0.0460658 -0.1739928 -0.5870802 -0.1077099 0.0443491 -0.1551772 -0.0577731 0.0051612 0.134083 0.0228189 0.0211955 -0.0096614 -0.0300453 0.0258173 -0.0850437 -0.0029799 0.013993 0.0225561 0.0457624 0.1278343 -0.0540932 0.0372989 -0.047093 0.0624523 0.1037894 0.0466031 -0.1085506 0.0279067 -0.0078563 0.5489478 -0.0191397 -0.0155119 -0.12396 0.2626937 -0.0452182 -0.072857 -0.048314 0.2989985 0.0762931 0.0376349 0.0044451 0.0032292 -0.0468043 -0.1105596 -0.0143399 -0.1067659 0.1247455 0.0907535 0.0052686 -0.0075136 0.0441149 -0.0320199 -0.0920199 0.0099111 -0.0964419 0.1182679 -0.0691547 -0.0823102 -0.0719754 -0.0832092 0.0508578 -0.0672046 -0.0741368 -0.0671595 0.1203557 -0.1176836 0.0871734 0.004813 0.0866816 0.0667686 -0.0368598 0.0036783 -0.036889 0.1478342 0.0026516 0.0526376 0.0084997 0.1169633 -0.0152773 -0.0354725 0.0088342 -0.0474409 0.1159622 0.093787 0.000717 -0.014879 -0.00567 0.0367937 0.094164 0.0082282 0.0918198 0.0306941 0.08697 -0.0117401 -0.0029257 0.0023045 0.0916704 -0.0857296 -0.0652069 -0.084208 -0.0577635 unknown
polarizability: 185.9914696|-2.6954677|107.0343432|10.7645089|24.6822288|73.3114856 unknown
InChI: InChI=1S/C10H10N2O/c1-7(13)6-10-11-8-4-2-3-5-9(8)12-10/h2-5,11H,6H2,1H3
charge 0 multiplicity 1
23 atoms
O  2.791892 -1.677474 -0.598346
N  0.231927 -0.847413 -0.111468
N  -0.011059 1.2064 0.862577
C  0.85607 0.240572 0.504856
C  -1.139176 -0.568981 -0.165506
C  -1.276964 0.723511 0.453915
C  2.335502 0.309315 0.771214
C  -2.243348 -1.284198 -0.674553
C  -2.554479 1.318113 0.569279
C  3.236948 -0.652919 -0.006069
C  -3.50895 -0.672631 -0.548256
C  -3.66231 0.607303 0.06362
C  4.718236 -0.317702 -0.016613
H  2.67559 1.349934 0.616414
H  2.52701 0.110358 1.849248
H  0.764427 -1.638601 -0.486856
H  -2.133901 -2.266559 -1.14563
H  -2.666361 2.300331 1.038525
H  -4.395517 -1.192354 -0.928382
H  -4.664379 1.043571 0.13995
H  5.313248 -1.215354 -0.245302
H  4.911427 0.435892 -0.805639
H  5.043867 0.125185 0.941121
