program: Gaussian 09
title: 000233583
version: EM64L-G09RevD.01
frameworkgroup: C1[X(C16H13BrN2O5)]
method: RPBEPBE
basis: SDD
operation: Freq
keyword: #p
keyword: freq=noraman
keyword: PBEPBE/SDD
title: #p freq=noraman PBEPBE/SDD
converged: YES YES NO NO
title: Mulliken charges:
elementType: Br O O O O O N N C C C C C C C C C C C C C C C C H H H H H H H H H H H H H
charge: 0.046700 -0.199629 -0.197016 -0.188989 -0.200677 -0.205038 0.152771 0.028097 -0.192359 -0.740580 0.503774 -0.428156 0.233347 -0.361492 -0.360931 0.323591 -0.361306 -0.375857 0.381623 -0.324549 -0.340189 -0.247681 -0.225432 -0.217475 0.333246 0.306488 0.282472 0.253463 0.270232 0.234468 0.290110 0.287500 0.241030 0.279537 0.237473 0.240891 0.240542
chargesum: 0.00000
title: Mulliken charges with hydrogens summed into heavy atoms:
elementType: Br O O O O O N N C C C C C C C C C C C C C C C C
charge: 0.046700 -0.199629 -0.197016 -0.188989 -0.200677 -0.205038 0.152771 0.028097 0.140887 -0.434091 0.503774 0.107779 0.233347 -0.091260 -0.126463 0.323591 -0.071195 -0.088357 0.381623 -0.083519 -0.060652 -0.010208 0.015459 0.023067
polarizability: 2.48204132e+02 1.42886653e+01 2.37175661e+02 -1.91663435e+01 -2.37412088e+00 1.97336650e+02
1716.lowfreq: -7.1376 -2.0598 -0.0007 -0.0005 -0.0001 5.8023 17.9619 18.5122 28.6615
frequency: 17.9455 18.4686 28.6416 33.9636 39.1473 40.7879 57.0944 70.4346 81.0124 114.4093 119.9938 143.3747 155.9425 160.6005 172.2079 204.7097 250.5162 272.7009 307.1540 340.5463 393.3066 397.6982 406.9869 413.5325 435.0238 470.8842 491.3287 516.1293 525.3201 555.0604 577.0296 612.6112 627.0859 636.9700 656.4025 667.2075 672.7651 690.3066 711.1384 740.8623 757.3944 781.4268 802.6965 808.2980 847.1811 852.2587 854.6059 865.1591 944.4854 966.1055 975.3348 986.0502 989.0305 991.9525 996.2863 1006.1658 1012.9865 1026.3040 1058.8263 1085.5113 1092.9931 1093.5418 1114.4296 1148.4936 1173.1585 1177.6979 1185.3974 1193.6008 1199.4553 1210.5613 1221.6629 1228.9005 1261.8616 1289.7545 1307.5543 1318.3711 1328.9117 1343.9831 1373.3072 1389.9210 1401.3832 1427.0850 1430.6237 1437.4470 1450.4992 1479.0814 1479.7014 1562.8313 1593.5883 1598.5844 1606.8956 1609.9930 3028.1451 3058.1877 3084.9438 3113.0807 3128.2208 3134.5371 3142.2532 3153.0822 3163.1165 3167.4831 3174.0157 3183.6071 3188.7160
redmass: 7.5765 7.3683 9.7995 11.5686 9.2283 4.7868 7.8567 6.0249 8.4879 8.8739 10.4556 7.1329 9.1435 4.8883 8.2360 6.3568 5.5854 6.7817 6.8310 6.1104 5.1740 2.8197 2.8721 5.5228 4.1607 4.5716 6.1055 5.5886 4.7696 5.0970 4.7117 6.4360 6.9807 5.6699 5.9912 6.1597 4.2367 1.9514 2.6917 4.6458 4.0360 5.4024 4.3470 3.2419 1.2661 1.2922 6.3231 1.6990 1.4467 2.7487 2.6960 1.3636 3.5082 1.6800 1.3930 3.1001 1.3551 2.1651 4.1866 2.1202 3.1143 1.8338 1.3503 1.3384 1.2714 1.0769 1.3643 1.1521 2.4024 1.5149 5.5486 4.4176 2.3470 1.3641 1.5152 1.4303 1.6371 1.4477 6.0703 8.9455 6.5402 2.9441 3.3024 2.2813 1.2078 2.3590 2.2238 7.8321 6.7730 7.4762 6.3746 6.2089 1.0603 1.0840 1.0868 1.1025 1.0902 1.0855 1.0883 1.0925 1.0962 1.0900 1.1014 1.0943 1.0966
irintensity: 0.9186 0.2800 0.8894 0.1776 0.4753 0.1982 3.5175 0.7725 3.5009 0.4115 6.0038 1.3976 0.8277 2.2951 0.4544 3.0447 0.8180 4.9629 6.7273 6.6557 6.9688 0.3303 0.1455 0.2269 1.6019 1.9547 3.1387 3.3984 21.9175 63.2875 27.7237 0.8718 2.4753 30.9640 3.8487 10.9172 26.0872 52.3523 9.8589 7.2355 7.8921 20.7390 2.2629 53.5983 1.9897 1.5100 14.4229 41.2173 3.2505 27.2577 16.4918 1.0334 5.6894 0.8325 0.4095 4.5999 0.3902 1.0463 19.0468 4.8415 16.1439 6.6937 22.6740 23.5779 19.6250 0.5597 64.9827 25.8573 1.4849 14.2769 256.2480 135.7045 135.8241 7.8804 21.5813 17.6019 12.9674 11.8147 104.0781 3.0945 5.7189 17.8763 151.5290 26.6412 8.5351 4.8085 2.5917 134.0522 42.8823 1.6023 33.3405 15.4601 12.5593 1.5710 3.5413 6.1597 10.9004 1.0443 4.6661 15.1248 12.5263 0.5876 19.2373 1.2946 3.9979
temp: 298.150 k
press: 1.00000 atm
elementType: 35 8 8 8 8 8 7 7 6 6 6 6 6 6 6 6 6 6 6 6 6 6 6 6 1 1 1 1 1 1 1 1 1 1 1 1 1
symmnumber: 1
zpe: 693152.3 jmol-1
zpe.correction: 0.264008 hartree
zpe.thermalcorrener: 0.285994 hartree
zpe.thermalcorrenthalpy: 0.286938 hartree
zpe.thermalcorrgfe: 0.207292 hartree
zpe.sumelectzpe: -1114.704562 hartree
zpe.sumelectthermal: -1114.682575 hartree
zpe.sumelectthermalent: -1114.681631 hartree
zpe.sumelectthermalfe: -1114.761277 hartree
dipole: 7.3984 -1.8971 -2.8828
dipole: 8.1637
quadrupole: -174.3173 -157.2548 -144.3209
quadrupole: -16.3587 -8.0502 -3.5928
quadrupole: -15.6863 1.3762 14.3101 -16.3587 -8.0502 -3.5928
hfenergy: -1114.9685694 hartree
pointgroup: C01 [X(C16H13Br1N2O5)]
dipole: -2.972816 0.1168952 1.2101811 debye
polarizability: 237.7747348|-13.0666247|245.183933|-19.3809664|12.3646621|199.7577757 unknown
InChI: InChI=1S/C16H13BrN2O5/c17-15(16(20)12-4-2-1-3-5-12)14(10-18(21)22)11-6-8-13(9-7-11)19(23)24/h1-9,14-15H,10H2
charge 0 multiplicity 1
37 atoms
Br -2.241044 3.224066 0.460956
O  -1.426556 0.612251 -1.859901
O  2.576203 3.308563 -0.969566
O  3.277606 3.59295 1.182726
O  3.858292 -3.57626 -1.190385
O  3.610232 -3.733766 1.071705
N  2.393663 3.286054 0.302901
N  3.419608 -3.138916 -0.058479
C  0.357385 1.823968 -0.066768
C  -1.094225 1.514692 0.365179
C  1.163849 0.51591 -0.049437
C  1.005547 2.903139 0.822121
C  -1.823424 0.610808 -0.658966
C  1.672645 -0.008388 -1.264146
C  1.413171 -0.178646 1.164148
C  -2.954298 -0.251745 -0.203067
C  2.418114 -1.202584 -1.276958
C  2.151933 -1.377087 1.171591
C  2.64284 -1.872063 -0.055084
C  -3.490541 -0.205118 1.113878
C  -3.507029 -1.164274 -1.145567
C  -4.553637 -1.056466 1.478235
C  -4.564892 -2.016133 -0.778007
C  -5.090387 -1.965559 0.536367
H  0.325817 2.199665 -1.103534
H  -1.14869 1.121495 1.391911
H  0.413641 3.83541 0.801118
H  1.156767 2.596729 1.868638
H  1.475369 0.522722 -2.199559
H  1.039216 0.214382 2.117258
H  2.821775 -1.619821 -2.202889
H  2.355023 -1.92749 2.093732
H  -3.108649 0.508237 1.851484
H  -3.085975 -1.183744 -2.155961
H  -4.966732 -1.010435 2.491245
H  -4.981388 -2.717966 -1.508015
H  -5.91423 -2.628075 0.823595
