program: Gaussian 09
title: 000233531
version: EM64L-G09RevD.01
frameworkgroup: C1[X(C13H25NO2)]
method: RPBEPBE
basis: SDD
operation: Freq
keyword: #p
keyword: freq=noraman
keyword: PBEPBE/SDD
title: #p freq=noraman PBEPBE/SDD
converged: YES YES NO NO
title: Mulliken charges:
elementType: O O N C C C C C C C C C C C C C H H H H H H H H H H H H H H H H H H H H H H H H H
charge: -0.422066 -0.230387 -0.585491 -0.398973 -0.389855 -0.383922 0.208941 -0.389323 -0.385803 -0.373783 -0.731723 -0.381592 0.096068 -0.456729 -0.034784 -0.598381 0.209742 0.192238 0.209318 0.220698 0.197949 0.195197 0.194802 0.195936 0.196170 0.193948 0.190925 0.196249 0.239506 0.211348 0.238988 0.194803 0.212091 0.270736 0.274120 0.205006 0.198424 0.211841 0.377029 0.213618 0.217118
chargesum: 0.00000
title: Mulliken charges with hydrogens summed into heavy atoms:
elementType: O O N C C C C C C C C C C C C C
charge: -0.045037 -0.230387 -0.040635 0.003007 0.040161 0.009224 0.208941 0.001415 0.004315 0.013391 -0.041881 0.025303 0.096068 -0.053298 0.177057 -0.167645
polarizability: 1.97227678e+02 -7.51403140e+00 1.37955268e+02 8.44418090e+00 -1.57599817e+00 1.31938983e+02
1716.lowfreq: -16.6979 -6.3752 -4.9350 -0.0009 -0.0008 0.0006 15.1791 19.5562 28.8949
frequency: 10.6524 16.0237 28.6966 35.1542 45.9462 59.3479 67.4275 96.7486 106.2879 109.7224 136.9445 141.9398 154.2760 186.4726 195.4953 223.9889 238.8797 257.0950 283.0315 326.4879 351.6841 358.0737 406.1650 439.7718 457.3925 487.5862 491.7549 562.1560 600.0302 637.1237 686.1558 704.7957 716.5743 724.4326 732.1375 742.4745 780.9477 835.3696 875.7308 913.3142 921.6375 939.3362 950.5219 982.4701 996.5575 1002.2644 1004.3450 1010.8935 1022.4315 1040.4066 1041.3138 1064.2045 1074.4861 1076.4727 1079.3626 1087.9014 1157.7827 1174.2635 1202.4308 1204.7869 1228.3340 1240.3398 1255.0364 1264.1956 1275.7347 1278.6805 1281.8929 1283.8450 1288.4022 1292.6142 1294.3345 1305.6473 1312.4202 1333.3030 1348.3987 1353.8943 1355.9175 1382.4936 1424.8132 1442.6837 1457.5960 1459.2389 1461.5818 1463.0365 1468.5209 1470.6740 1476.5953 1479.5249 1486.1203 1640.6325 1654.3127 1657.5684 2949.7662 2950.3640 2951.9652 2953.0091 2957.0145 2963.0835 2967.4486 2983.4040 2987.2188 2990.1628 2993.6112 2999.9802 3010.2025 3020.4130 3034.0758 3044.3149 3062.1646 3070.0965 3082.1457 3089.1906 3116.4356 3192.8438 3440.3607 3498.1344 3557.0819
redmass: 2.0359 3.8390 5.5979 5.6351 3.6534 1.9051 3.5631 2.4934 2.8282 2.0872 2.1770 2.3385 2.9122 2.8085 1.2908 1.2958 2.7269 1.8415 2.5967 3.3718 3.4649 2.8349 2.5695 2.4754 2.8832 3.2919 2.8141 3.3053 1.2874 1.5336 3.2693 1.5157 1.0731 1.1296 4.2618 1.1756 1.2495 1.3894 2.0085 1.4649 1.8145 1.3446 2.0989 1.3619 3.7007 1.7453 1.5255 1.7049 2.7168 1.7430 2.7179 2.3627 1.4967 2.1539 2.1177 3.4769 2.0498 1.9112 1.5185 1.5130 1.6649 1.3549 1.4645 1.3941 1.1928 1.5702 1.1777 1.3062 1.3529 1.1388 1.2229 1.2759 1.4240 1.4595 1.5386 1.6864 1.5665 1.2165 1.1793 1.0816 1.0896 1.0713 1.0877 1.0648 1.0628 1.0943 1.0519 1.1014 1.1011 4.4789 1.2489 4.7517 1.0590 1.0587 1.0611 1.0593 1.0593 1.0594 1.0603 1.0962 1.0374 1.0977 1.0589 1.0995 1.0995 1.1027 1.1041 1.1036 1.1039 1.0795 1.0972 1.0738 1.1006 1.1145 1.0457 1.0641 1.0954
irintensity: 0.2293 0.0720 1.0166 2.4496 0.1279 0.0060 0.1993 0.0224 0.1228 0.5679 0.0052 0.1666 4.1112 0.4100 45.3820 0.7926 2.2592 16.8621 6.7213 3.4494 26.3694 4.6108 0.7596 0.7534 0.8246 16.0960 4.6701 7.1106 132.8296 16.6098 28.6830 138.1339 32.0058 9.8030 17.9422 25.3764 9.5443 7.3841 2.4850 1.7252 5.0404 80.0138 1.8896 3.2052 0.8487 10.1924 7.2175 49.7371 179.0658 2.4109 3.1599 5.0357 1.3447 1.2035 0.1359 0.6694 16.2133 8.6557 9.0817 4.3583 1.6297 1.4163 2.0423 0.5977 2.1554 6.7534 0.5551 1.9608 3.1802 0.2780 1.2814 1.5582 1.6507 3.6675 0.4299 0.0675 1.8837 10.9986 3.5393 2.0014 2.7680 0.3738 0.7147 0.1539 7.0268 6.4665 11.9365 0.0702 25.5988 114.9392 155.9247 21.2861 0.1567 0.4946 11.2553 6.7606 0.9244 36.3136 166.7649 0.5569 26.8709 2.4878 34.4502 3.4449 2.0758 2.2718 21.0719 166.3014 57.5957 47.9138 29.2145 7.5038 16.0531 33.5046 0.6765 10.1654 0.4228
temp: 298.150 k
press: 1.00000 atm
elementType: 8 8 7 6 6 6 6 6 6 6 6 6 6 6 6 6 1 1 1 1 1 1 1 1 1 1 1 1 1 1 1 1 1 1 1 1 1 1 1 1 1
symmnumber: 1
zpe: 942304.6 jmol-1
zpe.correction: 0.358905 hartree
zpe.thermalcorrener: 0.379690 hartree
zpe.thermalcorrenthalpy: 0.380634 hartree
zpe.thermalcorrgfe: 0.304720 hartree
zpe.sumelectzpe: -714.257806 hartree
zpe.sumelectthermal: -714.237020 hartree
zpe.sumelectthermalent: -714.236076 hartree
zpe.sumelectthermalfe: -714.311991 hartree
dipole: 0.3618 0.0718 -1.0035
dipole: 1.0691
quadrupole: -105.3138 -99.3169 -102.7266
quadrupole: 1.2342 -5.3287 -4.4743
quadrupole: -2.8613 3.1355 -0.2742 1.2342 -5.3287 -4.4743
hfenergy: -714.6167104 hartree
pointgroup: C01 [X(C13H25N1O2)]
dipole: 0.1427303 -0.0201975 0.3951451 debye
polarizability: 197.1620259|7.5538285|137.9440675|-8.634693|-1.7259569|132.0158352 unknown
InChI: InChI=1S/C13H25NO2/c1-3-4-5-6-7-8-9-10-11-13(2,14)12(15)16/h3,15H,1,4-11,14H2,2H3
charge 0 multiplicity 1
41 atoms
O  4.458378 -1.56189 1.269255
O  4.699112 -1.778031 -1.024455
N  4.435676 1.03333 -1.429722
C  1.723098 0.238137 -0.224632
C  2.923906 0.84824 0.531203
C  0.371037 0.646303 0.404418
C  4.328139 0.505381 -0.058998
C  -0.847394 0.028139 -0.316894
C  -2.20098 0.472548 0.281774
C  -3.419366 -0.162908 -0.424827
C  5.433558 1.159116 0.809789
C  -4.77218 0.303306 0.158079
C  4.5185 -1.037033 -0.032688
C  -5.99103 -0.347049 -0.550272
C  -7.316128 0.161459 -0.02294
C  -8.296908 -0.605153 0.517635
H  1.799094 -0.869075 -0.231739
H  1.731969 0.566921 -1.283938
H  2.897953 0.5177 1.586673
H  2.844918 1.952112 0.516381
H  0.28289 1.75281 0.392449
H  0.357817 0.344497 1.472609
H  -0.815378 0.30296 -1.39208
H  -0.773924 -1.078907 -0.277433
H  -2.227911 0.214924 1.361239
H  -2.280052 1.578551 0.22479
H  -3.383881 0.079986 -1.507793
H  -3.349972 -1.268535 -0.352517
H  5.38716 0.793889 1.848068
H  6.440979 0.937721 0.409095
H  5.289985 2.253028 0.796612
H  -4.847281 1.407667 0.074783
H  -4.814672 0.068097 1.240401
H  5.391912 0.981859 -1.800558
H  3.779318 0.593079 -2.084651
H  -5.941135 -1.448338 -0.442945
H  -5.918356 -0.128253 -1.637448
H  -7.467502 1.251587 -0.087827
H  4.580798 -2.549699 1.228859
H  -9.232642 -0.169364 0.886145
H  -8.19001 -1.693811 0.606302
