program: Gaussian 09
title: 000233516
version: EM64L-G09RevD.01
frameworkgroup: C1[X(C16H16O2)]
method: RPBEPBE
basis: SDD
operation: Freq
keyword: #pfreq=noraman
keyword: PBEPBE/SDD
title: #p freq=noraman PBEPBE/SDD
converged: YES YES NO NO
title: Mulliken charges:
elementType: O O C C C C C C C C C C C C C C C C H H H H H H H H H H H H H H H H
charge: -0.264476 -0.411589 -0.220832 0.134487 -0.451484 -0.466097 0.113478 -0.415585 -0.400899 0.176977 0.225669 -0.387905 0.420344 -0.456318 -0.410104 -0.448982 -0.258647 -0.250083 0.270127 0.222083 0.216531 0.221652 0.219123 0.208146 0.217279 0.208011 0.223417 0.351476 0.249352 0.239842 0.235596 0.238762 0.224610 0.226042
chargesum: 0.00000
title: Mulliken charges with hydrogens summed into heavy atoms:
elementType: O O C C C C C C C C C C C C C C C C
charge: -0.264476 -0.060113 0.049295 0.134487 -0.012870 -0.025322 0.113478 0.009840 0.030528 0.176977 0.225669 -0.138552 0.420344 -0.216477 -0.174508 -0.210220 -0.034038 -0.024040
polarizability: 2.41866087e+02 -1.60151348e+01 1.88136856e+02 -3.09740554e+00 -1.29949423e+01 1.01764898e+02
1716.lowfreq: -9.4451 -0.0004 0.0005 0.0006 2.7518 10.8759 52.3706 74.2503 102.0873
frequency: 52.2777 74.2257 102.0785 142.7072 162.8855 178.4491 219.1617 234.5684 294.6897 328.9522 335.2511 352.2217 385.9778 418.2020 433.4800 464.7346 491.9660 501.4236 522.0348 536.2756 554.2661 569.3776 619.7050 633.9935 668.0737 708.8978 728.7388 750.3598 756.5735 766.1553 787.6883 821.2255 830.4669 854.5850 858.1873 876.4382 907.6835 947.5043 949.4826 963.0070 967.2240 969.1541 987.0640 994.3517 1025.7965 1042.8658 1072.9192 1094.0431 1114.4896 1128.3491 1143.0433 1150.2788 1166.7970 1174.9914 1193.2386 1215.2954 1228.1159 1231.3719 1248.1226 1263.0279 1274.2337 1287.4279 1323.0450 1329.5071 1335.7908 1342.9491 1363.7603 1376.7859 1402.3939 1422.5644 1445.3589 1455.1250 1464.4295 1469.2244 1483.4322 1490.2872 1526.8506 1589.0196 1598.5298 1637.3143 2984.1523 2992.7106 2997.9721 3007.1516 3013.2596 3032.8441 3055.0504 3058.6737 3071.9905 3118.3792 3126.0347 3131.2266 3142.6316 3160.7688 3171.1861 3547.0281
redmass: 3.1810 3.7302 4.2007 3.6062 3.3215 2.5873 2.9160 4.2528 2.3610 3.0910 4.2176 3.2663 2.0229 3.0876 2.9074 4.4159 4.2161 4.8103 3.9593 4.5850 3.1272 2.7423 3.5132 5.2580 4.1549 5.7940 4.9639 4.6869 1.3129 1.3844 3.4162 1.4419 2.5178 3.0416 3.6667 1.6783 2.5480 1.3288 2.4989 1.8931 1.5106 2.9560 1.3399 2.8270 2.1994 2.3004 2.0951 2.0418 2.8848 1.3342 1.2834 1.7661 1.4900 1.1902 1.4010 1.5623 1.6065 1.5925 2.1342 1.4561 1.7238 1.3860 1.3389 1.4827 1.4541 1.4917 1.8430 2.3468 4.4536 4.3113 3.1989 2.8726 1.0896 1.0790 1.0834 1.0868 4.6658 7.1594 7.1634 7.2680 1.0591 1.0658 1.0615 1.0653 1.0815 1.0998 1.1008 1.1019 1.1018 1.0859 1.0878 1.0890 1.0948 1.1004 1.0959 1.0650
irintensity: 0.4723 0.8446 0.2774 0.5978 0.3919 1.3936 1.4098 1.0916 31.3744 28.4703 1.8435 1.7445 102.0931 0.1088 28.8577 12.4103 14.6433 7.6662 2.6297 10.7731 2.9165 1.1081 2.8187 9.7207 3.2342 6.6104 15.6128 18.7865 36.8852 6.2840 16.6359 81.1350 21.6969 92.2403 23.3721 6.0340 17.9506 0.8540 86.8849 3.3510 7.8184 5.7008 1.0014 60.2256 4.5171 9.3075 14.5456 55.9800 6.3912 19.6923 1.4440 74.8082 4.4682 6.5012 6.9389 33.2703 18.5469 22.6216 59.6480 14.9616 4.2761 11.8922 2.9241 3.8125 2.5203 5.2465 9.7093 34.5922 13.0753 7.1387 2.4838 25.9757 8.8182 7.4686 14.0790 6.7084 22.3575 21.8088 14.3728 43.7854 21.6877 22.0031 44.2312 40.3629 9.9613 17.9084 16.6492 41.9354 59.6721 4.1768 2.0498 8.9562 39.0717 35.0370 10.5370 10.5131
temp: 298.150 k
press: 1.00000 atm
elementType: 8 8 6 6 6 6 6 6 6 6 6 6 6 6 6 6 6 6 1 1 1 1 1 1 1 1 1 1 1 1 1 1 1 1
symmnumber: 1
zpe: 732255.7 jmol-1
zpe.correction: 0.278901 hartree
zpe.thermalcorrener: 0.293044 hartree
zpe.thermalcorrenthalpy: 0.293988 hartree
zpe.thermalcorrgfe: 0.238573 hartree
zpe.sumelectzpe: -768.478646 hartree
zpe.sumelectthermal: -768.464504 hartree
zpe.sumelectthermalent: -768.463560 hartree
zpe.sumelectthermalfe: -768.518975 hartree
dipole: -1.3812 -0.7383 -0.7750
dipole: 1.7474
quadrupole: -90.7640 -97.5714 -111.0750
quadrupole: 0.2846 -0.5304 -0.5087
quadrupole: 9.0395 2.2321 -11.2715 0.2846 -0.5304 -0.5087
hfenergy: -768.7575473 hartree
pointgroup: C01 [X(C16H16O2)]
dipole: 0.5372747 0.2969801 -0.3094775 debye
polarizability: 242.5502737|-14.7519517|187.8954722|3.3320805|11.4392456|101.3220954 unknown
InChI: InChI=1S/C16H16O2/c17-16-10-4-3-7-13(16)15-12-6-2-1-5-11(12)8-9-14(15)18-16/h1-2,5-6,8-9,13,17H,3-4,7,10H2
charge 0 multiplicity 1
34 atoms
O  1.577242 -1.788805 -0.131453
O  2.51502 -0.744334 1.818506
C  1.220424 0.607915 0.292948
C  2.262733 -0.549959 0.403945
C  1.591963 1.562556 -0.872889
C  3.548847 -0.340792 -0.403454
C  -0.084407 -0.149037 0.096007
C  3.012054 2.16315 -0.683776
C  4.05494 1.105106 -0.190319
C  0.197897 -1.494348 -0.155767
C  -1.435645 0.307295 0.1105
C  -0.801833 -2.464569 -0.42897
C  -2.482521 -0.665072 -0.169513
C  -2.132026 -2.032633 -0.437367
C  -1.811353 1.664689 0.391009
C  -3.849372 -0.232732 -0.165263
C  -3.153902 2.049878 0.389348
C  -4.183698 1.096272 0.105296
H  1.238309 1.1641 1.248797
H  0.842407 2.371272 -0.951155
H  1.536746 0.999155 -1.824454
H  3.336536 -0.523519 -1.471798
H  4.311898 -1.080239 -0.092779
H  2.964701 2.996158 0.043475
H  3.339132 2.603789 -1.644399
H  5.018676 1.244013 -0.713193
H  4.254684 1.247069 0.88856
H  3.067961 -1.560229 1.933296
H  -0.52783 -3.505337 -0.622376
H  -2.935547 -2.748682 -0.646179
H  -1.030215 2.398444 0.620342
H  -4.635305 -0.968154 -0.376838
H  -3.42703 3.088001 0.609881
H  -5.232083 1.413878 0.106332
