program: Gaussian 09
title: 000233555
version: EM64L-G09RevD.01
frameworkgroup: C1[X(C23H18O3)]
method: RPBEPBE
basis: SDD
operation: Freq
keyword: #pfreq=noraman
keyword: PBEPBE/SDD
title: #p freq=noraman PBEPBE/SDD
converged: YES YES NO NO
title: Mulliken charges:
elementType: O O O C C C C C C C C C C C C C C C C C C C C C C C H H H H H H H H H H H H H H H H H H
charge: -0.200616 -0.172554 -0.201697 -0.352462 -0.425990 -0.224728 0.487584 0.157944 0.510831 0.121580 -0.440587 -0.365858 -0.434494 -0.371857 0.306091 -0.223822 -0.248938 -0.225914 -0.249362 -0.243041 -0.343928 -0.342954 -0.241711 -0.250341 -0.229403 -0.223461 0.270402 0.274937 0.266360 0.236778 0.251839 0.228132 0.280863 0.231644 0.231940 0.226776 0.229165 0.234205 0.245642 0.279654 0.229220 0.237118 0.237812 0.237202
chargesum: 0.00000
title: Mulliken charges with hydrogens summed into heavy atoms:
elementType: O O O C C C C C C C C C C C C C C C C C C C C C C C
charge: -0.200616 -0.172554 -0.201697 -0.082061 -0.151053 0.041632 0.487584 0.157944 0.510831 0.121580 -0.203809 -0.114020 -0.206363 -0.090994 0.306091 0.007822 -0.016998 0.000862 -0.020196 -0.008836 -0.098287 -0.063300 -0.012491 -0.013222 0.008408 0.013741
polarizability: 2.69530242e+02 1.22184895e+01 2.77863886e+02 -1.28662526e+01 4.67630417e+00 1.94402779e+02
1716.lowfreq: -7.2436 -0.0002 0.0003 0.0006 2.4552 3.4190 12.4303 25.1281 31.5563
frequency: 11.3906 25.0542 31.5087 32.9857 37.9521 38.4179 73.0857 74.6674 112.6125 142.1469 145.8684 172.7123 186.6928 227.1252 250.2132 259.8093 308.0699 317.6888 333.9586 400.2948 402.3220 403.3856 422.3561 456.5186 469.0171 479.9723 520.4865 548.9108 593.7947 610.7393 613.1453 614.6511 629.0278 654.8739 666.2469 687.4612 698.2615 706.9524 707.6948 721.1272 761.3268 765.2543 789.4766 811.8065 832.0998 854.1645 856.9247 859.2059 859.9732 880.4435 917.8899 924.1189 941.8624 954.8978 974.3439 978.9258 982.6649 988.6015 989.8733 989.9930 992.6707 997.9631 1001.1941 1010.3654 1012.5011 1022.9351 1027.3083 1030.6823 1036.6096 1079.0655 1087.3815 1088.4340 1091.0890 1173.2280 1174.0218 1175.3108 1191.6290 1192.2448 1196.5532 1198.8519 1206.9599 1210.8401 1221.3267 1236.8736 1251.2852 1282.7773 1300.6558 1318.1733 1340.9286 1345.5084 1357.8505 1382.9883 1385.3129 1388.3692 1436.8220 1443.4392 1445.6905 1481.0270 1483.3368 1486.2517 1570.0920 1591.5811 1593.5206 1596.6768 1612.1637 1612.2726 1613.5274 1709.1703 3016.2715 3040.9410 3075.7075 3112.9306 3118.4866 3120.3889 3120.6422 3131.3644 3133.3150 3135.3279 3139.6549 3146.3105 3147.1955 3149.9208 3160.4500 3163.4629 3165.5927 3171.0479
redmass: 5.7608 4.4737 4.7689 5.1019 4.5325 3.9762 8.0181 5.8332 6.5488 5.5180 7.5006 5.1644 5.5098 4.5143 5.4421 6.7877 7.1138 6.9397 5.3900 2.7898 2.8241 2.8362 4.4554 5.6227 5.5317 4.9936 4.3373 3.8259 5.8031 6.2830 6.4379 6.4634 6.4049 6.5140 6.1172 4.4147 1.6924 1.7000 1.7704 7.1650 1.9224 1.9668 2.3127 5.0236 5.1433 1.2627 1.6394 1.7597 1.5652 4.2828 1.7041 1.5221 1.6631 2.4626 4.6164 1.3931 1.3904 4.9091 5.8969 6.1908 1.4838 1.3844 1.3929 2.0814 2.0676 3.0776 2.2266 2.1976 2.6881 2.3525 1.6493 1.7193 2.4315 1.0569 1.0561 1.0664 1.1319 1.1366 1.1744 1.8313 1.8855 1.5310 1.2276 1.3452 2.4806 1.6279 1.6336 1.3501 1.2672 1.3085 1.4149 7.2661 5.3255 8.8453 2.2695 2.1584 2.1362 2.1984 2.2686 2.2468 7.1429 5.9513 6.0043 6.7234 6.0512 6.4748 5.9246 12.9481 1.0831 1.0856 1.0862 1.0886 1.0868 1.0875 1.0893 1.0853 1.0911 1.0901 1.0883 1.0957 1.0954 1.0924 1.0962 1.1014 1.1013 1.1014
irintensity: 0.6271 0.0262 0.4584 0.3148 0.3337 0.2746 0.3452 0.4635 4.7474 0.1728 2.7791 0.3729 1.2544 1.1525 1.8904 3.5659 4.6521 2.1811 1.0941 0.3310 0.0119 0.0162 0.8631 5.0223 7.5481 4.0997 4.9402 11.7185 4.2919 5.7983 0.2563 0.2737 36.2863 4.8834 11.2156 1.7266 68.9535 73.4346 43.3403 6.7317 18.9906 50.9546 26.0886 2.2451 4.1807 0.5004 12.0305 8.2724 8.2182 23.3735 3.9216 0.2865 20.5584 60.3267 58.5505 0.3332 0.5431 7.5620 0.6950 2.5434 0.4595 0.8175 1.0115 9.5776 7.7498 14.7591 7.7624 2.3704 53.6474 95.4834 17.3279 24.6745 116.8874 0.0671 0.1005 3.5625 28.6565 2.0411 0.7133 1.4503 43.7406 19.2491 5.7038 12.8623 92.7095 8.8385 4.2033 1.0092 3.7865 7.2390 22.1268 0.0781 0.1527 2.7399 25.2957 9.7566 10.9916 2.1865 14.4880 28.3535 99.1677 2.7351 2.2431 51.8661 12.2883 6.6207 6.6827 373.9216 3.6730 9.8280 20.4304 6.3576 6.5739 6.6267 2.5870 0.1757 6.7300 5.3939 4.3971 25.9531 28.0482 12.9919 12.4338 33.8474 23.0996 23.3591
temp: 298.150 k
press: 1.00000 atm
elementType: 8 8 8 6 6 6 6 6 6 6 6 6 6 6 6 6 6 6 6 6 6 6 6 6 6 6 1 1 1 1 1 1 1 1 1 1 1 1 1 1 1 1 1 1
symmnumber: 1
zpe: 901012.4 jmol-1
zpe.correction: 0.343178 hartree
zpe.thermalcorrener: 0.364567 hartree
zpe.thermalcorrenthalpy: 0.365512 hartree
zpe.thermalcorrgfe: 0.288572 hartree
zpe.sumelectzpe: -1111.124753 hartree
zpe.sumelectthermal: -1111.103363 hartree
zpe.sumelectthermalent: -1111.102419 hartree
zpe.sumelectthermalfe: -1111.179359 hartree
dipole: 4.6540 3.5377 -5.4444
dipole: 7.9885
quadrupole: -138.0480 -135.7540 -161.3217
quadrupole: -4.4525 7.7111 9.3137
quadrupole: 6.9932 9.2873 -16.2805 -4.4525 7.7111 9.3137
hfenergy: -1111.4679304 hartree
pointgroup: C01 [X(C23H18O3)]
dipole: 2.1152582 -0.4693688 -2.276691 debye
polarizability: 283.950236|4.6155539|263.6729071|-13.9881936|4.0122098|194.1737637 unknown
InChI: InChI=1S/C23H18O3/c24-21(18-14-8-3-9-15-18)22-19(16-10-4-1-5-11-16)20(23(25)26-22)17-12-6-2-7-13-17/h1-15,19-20,22H
charge 0 multiplicity 1
44 atoms
O  -0.299705 0.150359 2.4699
O  -2.026366 1.633406 2.900013
O  -1.219244 -2.150045 1.275634
C  0.127801 0.579968 0.083069
C  -1.051697 1.486761 0.59507
C  0.438289 -0.371919 1.310279
C  1.348685 1.367549 -0.37352
C  -1.243754 1.133031 2.084586
C  -2.337357 1.38354 -0.221174
C  -0.027817 -1.8147 1.01918
C  1.760863 1.329219 -1.729041
C  2.084654 2.167958 0.541841
C  -2.716651 2.454608 -1.067158
C  -3.148845 0.219926 -0.171874
C  0.941224 -2.764261 0.386442
C  2.879659 2.075577 -2.16558
C  3.202268 2.912629 0.108623
C  -3.885025 2.368475 -1.857381
C  -4.317071 0.136294 -0.959309
C  3.603986 2.869525 -1.247986
C  2.223009 -2.361266 -0.081439
C  0.542772 -4.122357 0.239476
C  -4.688834 1.207269 -1.805974
C  3.085749 -3.302035 -0.683173
C  1.409214 -5.060015 -0.352568
C  2.684667 -4.651745 -0.81529
H  -0.235976 -0.024981 -0.764828
H  -0.722733 2.542785 0.581591
H  1.503247 -0.343174 1.586991
H  1.199752 0.716472 -2.445506
H  1.782639 2.211723 1.596682
H  -2.100201 3.361377 -1.103627
H  -2.872591 -0.613534 0.486271
H  3.183424 2.037574 -3.217623
H  3.758962 3.526642 0.825203
H  -4.169006 3.20562 -2.504838
H  -4.941243 -0.762777 -0.907486
H  4.470771 3.44893 -1.584331
H  2.551793 -1.319678 0.000669
H  -0.449719 -4.41135 0.600622
H  -5.598365 1.139509 -2.413357
H  4.068779 -2.9845 -1.046687
H  1.0981 -6.105122 -0.454755
H  3.360196 -5.381071 -1.276037
