program: Gaussian 09
title: 000233485
version: EM64L-G09RevD.01
frameworkgroup: C1[X(C4H6ClNO3)]
method: RPBEPBE
basis: SDD
operation: Freq
keyword: #p
keyword: freq=noraman
keyword: PBEPBE/SDD
title: #p freq=noraman PBEPBE/SDD
converged: YES YES NO NO
title: Mulliken charges:
elementType: Cl O O O N C C C C H H H H H H
charge: -0.075793 -0.265917 -0.442020 -0.212568 -0.377145 -0.388051 0.306776 -0.662977 0.185891 0.283913 0.283561 0.375204 0.295725 0.295753 0.397646
chargesum: 0.00000
title: Mulliken charges with hydrogens summed into heavy atoms:
elementType: Cl O O O N C C C C
charge: -0.075793 -0.265917 -0.044374 -0.212568 -0.001941 0.179424 0.306776 -0.071499 0.185891
polarizability: 8.37286876e+01 5.69448450e-01 8.23433486e+01 -4.93010660e-02 1.76154366e-02 3.70738553e+01
1716.lowfreq: -4.3767 0.0011 0.0030 0.0031 3.2361 6.8768 33.4937 42.3400 73.4818
frequency: 33.3680 42.2839 73.4743 85.3760 185.6429 205.8023 256.9406 368.9157 455.4612 493.7978 544.7877 562.9060 616.4575 649.2037 686.7399 702.8351 823.9163 909.5064 947.9766 978.4392 1079.3431 1126.4202 1150.8336 1216.6780 1243.6707 1255.6258 1306.7208 1335.8297 1420.0612 1457.8239 1503.3718 1605.9453 1685.2915 2993.5665 3032.2372 3070.8202 3151.9682 3507.4106 3533.8028
redmass: 3.0446 10.4055 4.0405 12.4117 2.4200 9.5012 8.5931 13.7118 7.8758 1.9032 4.1927 3.0187 4.6591 1.3882 6.4720 1.1311 4.8020 1.7255 5.8361 2.0414 2.0773 4.9791 1.1199 1.0807 1.7702 1.1916 2.4144 1.6048 1.0908 1.0743 2.2674 9.6679 9.3500 1.0602 1.0995 1.0567 1.1091 1.0783 1.0646
irintensity: 0.1289 6.4812 10.3342 0.0254 7.9099 13.7988 2.4857 0.1918 32.9663 38.0556 33.4122 0.5986 4.7758 119.1685 82.1006 140.4622 20.6510 12.0657 26.1964 0.7997 208.9902 6.0722 0.5056 0.0103 4.4699 19.4431 52.4231 2.0551 36.2146 14.8245 329.0102 210.0849 256.6158 19.1345 4.3015 3.7308 1.0357 78.7509 41.4744
temp: 298.150 k
press: 1.00000 atm
elementType: 17 8 8 8 7 6 6 6 6 1 1 1 1 1 1
symmnumber: 1
zpe: 276943.0 jmol-1
zpe.correction: 0.105482 hartree
zpe.thermalcorrener: 0.115282 hartree
zpe.thermalcorrenthalpy: 0.116226 hartree
zpe.thermalcorrgfe: 0.067798 hartree
zpe.sumelectzpe: -895.826573 hartree
zpe.sumelectthermal: -895.816773 hartree
zpe.sumelectthermalent: -895.815829 hartree
zpe.sumelectthermalfe: -895.864257 hartree
dipole: -0.0545 -2.4762 0.0030
dipole: 2.4768
quadrupole: -64.6772 -64.4865 -57.5931
quadrupole: -6.5983 -0.0167 -0.0307
quadrupole: -2.4249 -2.2343 4.6592 -6.5983 -0.0167 -0.0307
hfenergy: -895.9320549 hartree
pointgroup: C01 [X(C4H6Cl1N1O3)]
dipole: -0.0015565 -0.9559326 -0.1890517 debye
dipolederiv: -0.2886326 0.0568369 0.029111 0.2318903 -0.5986307 -0.1173157 0.062723 -0.0924541 -0.1866338 -0.6855768 0.1891063 0.0812986 -0.290731 -0.9857857 -0.0800016 -0.0117816 -0.1476021 -0.3950253 -0.4523591 0.2048468 0.045162 0.3086318 -1.075689 -0.1728091 0.065529 -0.1586334 -0.4664438 -1.0944378 0.1601253 0.1379649 -0.0703645 -0.5560104 -0.0374295 0.0915751 -0.0687862 -0.34793 -1.1063882 -0.294929 0.0388797 -0.3517812 -0.6527931 0.0031664 0.027208 -0.0046745 -0.4232177 0.3893001 -0.1461024 -0.0431241 -0.3591992 -0.0676623 -0.02369 -0.0849156 -0.0528996 0.3021053 1.283959 0.0591588 -0.1406129 0.6672072 1.0911119 0.0810097 -0.0235023 0.1661844 0.2363098 -0.0649577 0.030771 0.0363574 -0.2138186 0.7371756 0.1428516 -0.0102141 0.1084963 0.1724042 1.4465526 -0.1561227 -0.1992733 -0.0352778 1.382423 0.2386858 -0.1744558 0.2549432 0.2928697 -0.0160731 -0.0136614 -0.0093184 0.0919333 0.0659478 0.0554661 -0.025425 0.0654314 0.0420723 -0.0028955 -0.0315111 0.0071658 0.0586192 0.1073942 -0.0464859 0.0619535 -0.0297378 -0.0162456 0.3438457 0.0024954 -0.0013728 0.0216341 0.2607435 -0.0157091 0.0029594 -0.0128172 0.3235023 0.0826573 0.0094247 0.0439738 -0.0097606 -0.0307113 0.0361238 0.0717437 0.0097952 0.0218608 0.0474435 0.0216651 -0.0485824 0.0073649 -0.0057977 -0.0537234 -0.0827567 -0.0320469 0.032487 0.1175625 -0.0921037 0.0223706 -0.0563479 0.3282843 -0.0101392 0.0293596 -0.0051985 0.4118849 unknown
polarizability: 82.8522769|0.6164273|80.6906932|-6.2324765|8.4769784|39.6029214 unknown
InChI: InChI=1S/C4H6ClNO3/c5-1-3(7)6-2-4(8)9/h6,8H,1-2H2
charge 0 multiplicity 1
15 atoms
Cl 2.649005 -1.432874 -0.961723
O  1.215945 2.271604 -0.040586
O  -1.741135 -1.57548 -0.392617
O  -3.452568 -0.089641 0.139269
N  0.182687 0.201535 -0.299331
C  -1.146037 0.739608 -0.008115
C  1.273562 1.026095 -0.291938
C  2.645468 0.428332 -0.602826
C  -2.243864 -0.307018 -0.069259
H  -1.40543 1.552782 -0.713917
H  -1.171819 1.207306 0.995579
H  0.279377 -0.797327 -0.508353
H  3.065522 0.912545 -1.496356
H  3.31566 0.575312 0.256504
H  -2.480174 -2.239983 -0.425532
