program: Gaussian 09
title: 000233481
version: EM64L-G09RevD.01
frameworkgroup: C1[X(C12H8Br2S2)]
method: RPBEPBE
basis: SDD
operation: Freq
keyword: #p
keyword: freq=noraman
keyword: PBEPBE/SDD
title: #p freq=noraman PBEPBE/SDD
converged: YES YES NO NO
title: Mulliken charges:
elementType: Br Br S S C C C C C C C C C C C C H H H H H H H H
charge: 0.037635 0.042388 0.090438 0.113120 -0.192763 -0.198849 -0.148371 -0.181732 -0.171565 -0.158967 -0.180388 -0.177640 -0.215687 -0.220413 -0.215320 -0.218734 0.263144 0.265459 0.255515 0.255875 0.238032 0.239346 0.239288 0.240190
chargesum: 0.00000
title: Mulliken charges with hydrogens summed into heavy atoms:
elementType: Br Br S S C C C C C C C C C C C C
charge: 0.037635 0.042388 0.090438 0.113120 -0.192763 -0.198849 -0.148371 -0.181732 0.091580 0.106492 0.075126 0.078235 0.022345 0.018933 0.023968 0.021456
polarizability: 2.57298330e+02 1.97664782e+01 2.00151591e+02 -2.68153515e+01 9.47867915e+00 1.49417350e+02
1716.lowfreq: -5.2888 -0.0026 -0.0018 -0.0011 5.3354 9.6079 12.5235 15.0520 19.5228
frequency: 12.2129 14.9121 19.4993 56.9274 69.4052 112.0063 134.3832 160.3604 172.4776 214.9881 250.9095 273.1816 277.6226 351.8226 357.9000 380.8769 413.9543 417.0752 445.3323 446.9411 511.2115 514.0451 632.7688 633.2611 698.0013 698.7613 707.7782 711.1488 760.3248 761.5176 868.0782 869.3607 956.1913 957.2363 989.3925 989.8801 991.9313 992.1822 1024.6309 1026.0185 1084.7652 1088.2499 1117.5402 1118.9826 1172.3760 1172.6334 1246.5288 1246.7945 1355.3581 1358.4597 1408.3174 1409.4348 1425.0062 1426.2696 1560.6191 1561.0930 1571.2854 1572.9485 3139.4064 3139.4977 3152.1415 3152.4261 3165.5102 3165.9990 3176.3037 3176.7542
redmass: 8.2637 18.6675 8.6126 10.8696 6.2136 4.3470 6.3787 18.2670 22.1257 5.8545 6.8634 9.0055 8.3870 9.9092 7.0596 8.7295 9.5290 10.3635 3.4474 3.4979 4.0847 4.0526 6.7113 6.7223 6.7683 6.3640 4.3194 4.6039 1.2192 1.2212 1.3443 1.3438 1.3793 1.3779 6.3402 3.3756 1.7901 1.3706 3.5947 3.4110 2.3043 2.3590 1.6654 1.6705 1.0585 1.0580 1.3799 1.3815 10.0582 10.0657 1.9878 1.9958 2.2629 2.2572 6.0795 6.0312 6.2776 6.3341 1.0858 1.0858 1.0904 1.0905 1.0951 1.0951 1.1007 1.1006
irintensity: 0.6080 0.2100 0.3028 0.3525 0.9356 0.3019 0.6797 0.3495 0.1307 2.3763 4.2618 2.5083 2.0247 1.7610 1.9198 0.0730 9.2691 8.5067 11.3407 6.7050 1.5210 0.7798 8.2123 6.6408 11.9429 10.7610 3.4384 4.6150 84.7486 70.9679 0.0129 0.3067 1.2863 0.8781 32.5274 31.3632 12.8969 1.1792 8.0223 3.4103 9.5105 20.0836 2.8781 1.3077 1.0809 0.2896 6.0135 6.1145 0.6589 0.3626 26.4299 17.6955 50.5237 23.3480 10.5931 17.5278 10.4864 9.7581 1.1934 0.9971 6.3297 6.1488 8.2266 8.4476 21.0247 16.2232
temp: 298.150 k
press: 1.00000 atm
elementType: 35 35 16 16 6 6 6 6 6 6 6 6 6 6 6 6 1 1 1 1 1 1 1 1
symmnumber: 1
zpe: 418939.5 jmol-1
zpe.correction: 0.159566 hartree
zpe.thermalcorrener: 0.175438 hartree
zpe.thermalcorrenthalpy: 0.176382 hartree
zpe.thermalcorrgfe: 0.110565 hartree
zpe.sumelectzpe: -1283.984781 hartree
zpe.sumelectthermal: -1283.968909 hartree
zpe.sumelectthermalent: -1283.967964 hartree
zpe.sumelectthermalfe: -1284.033782 hartree
dipole: -2.5099 2.6289 2.5945
dipole: 4.4656
quadrupole: -108.5900 -117.7731 -124.7797
quadrupole: 8.3214 -7.1881 2.6794
quadrupole: 8.4576 -0.7255 -7.7321 8.3214 -7.1881 2.6794
hfenergy: -1284.1443466 hartree
pointgroup: C01 [X(C12H8Br2S2)]
dipole: 0.692237 -1.4216863 0.7657421 debye
dipolederiv: -0.1003393 0.1457479 -0.0903874 0.2486739 -0.4089198 0.2463925 -0.1426671 0.2498506 -0.1584079 -0.1734913 -0.1446512 -0.2931055 -0.1150875 -0.0989709 -0.1799748 -0.1759112 -0.1584732 -0.3277904 0.1364553 0.1881597 -0.0696333 0.3106654 0.096406 0.0623729 0.0709143 0.0459194 -0.0025444 0.1749333 -0.2263761 -0.076141 -0.1970251 0.0113621 -0.0483728 0.1882911 -0.0785573 0.0109045 -0.0830272 0.1375573 0.0337984 0.0908833 -0.2302182 0.1592902 -0.1470371 -0.0174582 -0.1775176 -0.0304012 -0.2053335 -0.105142 0.0112761 -0.1333646 -0.0736718 -0.0952402 -0.0013589 -0.2333311 0.2145479 -0.1100869 0.1095781 -0.6186917 0.736507 -0.5338651 0.417252 -0.3977356 0.2023994 0.1939673 0.3488097 0.6330734 -0.0737711 0.1414099 0.2946856 0.237892 0.3527495 0.5647689 -0.1602047 -0.0619252 0.0795944 0.1072547 0.0111479 -0.0030294 -0.0288408 -0.0286496 -0.0324201 -0.0106359 -0.0517459 0.0154618 0.1434221 0.0039886 0.0236546 0.0864026 0.0304281 -0.0489119 -0.0211121 0.0100403 0.0712362 0.0288574 -0.4130506 0.1696253 0.0380635 0.1243881 -0.0849191 -0.2999 -0.0790234 -0.1881047 -0.0209229 0.0076791 0.0086482 -0.1891538 -0.0060319 -0.2247114 -0.2136473 -0.0189393 0.0057435 -0.0862841 0.0394838 -0.1146034 -0.0462197 -0.0608557 -0.0885812 -0.0542911 0.0808674 0.1390015 0.0906009 -0.1377081 -0.0030519 0.1080733 0.0660453 -0.043881 0.0172087 0.0083683 0.1397015 0.0406443 0.1328615 -0.0060274 0.1167143 -0.0752884 0.0009848 0.0194345 -0.0994089 0.1025023 -0.0155179 0.0863553 0.0918213 0.1096421 0.0451722 0.0008151 0.0223647 0.0091485 -0.097275 0.0219779 0.068272 -0.0037439 -0.0871084 0.0159929 0.0680992 0.1225166 0.0468027 -0.0196407 0.0155074 -0.0013291 -0.0642567 -0.0061188 -0.0581547 0.082021 0.0197201 -0.0133016 -0.0910215 -0.0140149 0.0931137 0.0194192 -0.1156194 0.0113646 0.0646289 0.0991804 0.0205686 -0.0163099 0.0591888 -0.01343 -0.0749723 -0.0224696 -0.0742988 0.094181 0.104877 0.0307387 -0.0539582 -0.0187135 -0.058595 0.0928471 -0.0527473 0.0853418 0.0786183 -0.0051469 -0.0162063 -0.1101774 -0.0204567 0.0788387 -0.0630758 -0.1372826 -0.0608976 0.0389958 0.047831 -0.091564 -0.0461437 -0.0968214 -0.047499 -0.004095 -0.0564369 -0.0110726 0.1136607 -0.0208398 0.0917532 -0.0726507 0.1083545 0.0356597 0.0039835 -0.0703923 0.0015802 0.1029388 unknown
polarizability: 256.5864512|1.1947942|198.9374225|36.4676541|-1.9640672|151.343397 unknown
InChI: InChI=1S/C12H8Br2S2/c13-9-5-1-3-7-11(9)15-16-12-8-4-2-6-10(12)14/h1-8H
charge 0 multiplicity 1
24 atoms
Br -3.378702 2.011968 -1.225811
Br 0.874746 -1.066291 -2.148161
S  -0.853409 1.808003 1.129247
S  0.596394 2.042548 -0.680875
C  -1.836229 0.34177 0.661216
C  1.94308 0.897074 -0.205035
C  -2.910344 0.373696 -0.267589
C  2.116189 -0.382815 -0.796476
C  -1.542494 -0.8847 1.316689
C  2.892582 1.328575 0.760715
C  -3.670524 -0.784279 -0.536442
C  3.204451 -1.20871 -0.435404
C  -2.303248 -2.044432 1.061476
C  3.975964 0.508036 1.134435
C  -3.365982 -1.992866 0.131208
C  4.131082 -0.762933 0.53332
H  -0.706646 -0.908588 2.022869
H  2.762211 2.318462 1.209069
H  -4.491993 -0.741209 -1.257298
H  3.323618 -2.188474 -0.90697
H  -2.062603 -2.979546 1.577272
H  4.69546 0.85927 1.881041
H  -3.960988 -2.887329 -0.081784
H  4.971085 -1.40913 0.809589
