program: Gaussian 09
title: 000233470
version: EM64L-G09RevD.01
frameworkgroup: C1[X(C16H20OS)]
method: RPBEPBE
basis: SDD
operation: Freq
keyword: #p
keyword: freq=noraman
keyword: PBEPBE/SDD
title: #p freq=noraman PBEPBE/SDD
converged: NO YES NO NO
title: Mulliken charges:
elementType: S O C C C C C C C C C C C C C C C C H H H H H H H H H H H H H H H H H H H H
charge: 0.190770 -0.236527 -0.196717 -0.195021 -0.150176 -0.121672 -0.509730 -0.508972 -0.442497 -0.385112 -0.384076 -0.173427 -0.216114 -0.263012 -0.381105 -0.378382 0.444793 -0.804450 0.263819 0.242336 0.231609 0.223716 0.235738 0.277880 0.268726 0.210462 0.263411 0.193748 0.230756 0.229226 0.193539 0.243573 0.252855 0.230635 0.231585 0.226250 0.225773 0.235791
chargesum: 0.00000
title: Mulliken charges with hydrogens summed into heavy atoms:
elementType: S O C C C C C C C C C C C C C C C C
charge: 0.190770 -0.236527 0.067102 0.047315 0.081433 0.102044 0.003887 -0.240246 0.031376 0.039392 0.038688 -0.173427 0.027460 -0.010157 -0.150471 -0.146797 0.444793 -0.116635
polarizability: 2.53085354e+02 -2.00146051e+01 1.44645053e+02 1.38115503e+00 -8.85323890e-01 1.59067116e+02
1716.lowfreq: -22.4402 -16.6340 -8.4016 -4.8080 -0.0029 -0.0022 -0.0018 9.8874 16.4820
frequency: -15.3259 5.4021 15.8385 32.9167 75.0161 118.3405 134.3187 156.2502 205.8285 231.9011 258.1112 272.3863 310.1742 347.6682 356.8631 379.3117 402.7620 409.5752 474.6827 501.7099 534.1730 608.7423 630.7980 637.1312 681.9963 712.3346 727.3857 750.5553 786.9517 788.2839 807.5656 820.6005 836.2414 847.0364 857.0160 891.1434 900.7891 916.2250 928.1859 938.5601 952.5069 970.7804 972.3417 976.9859 983.3306 997.0590 1003.9848 1025.5419 1043.5664 1046.3755 1051.1965 1070.1130 1076.1261 1093.1625 1112.6019 1117.6443 1123.6620 1139.3388 1158.5477 1184.2901 1186.1465 1200.5518 1209.0234 1219.3536 1227.8928 1252.9667 1255.6558 1258.6616 1272.6531 1284.2779 1291.0293 1295.2049 1303.8062 1321.8445 1324.8629 1350.5927 1358.8605 1391.8303 1394.7997 1457.6209 1469.0138 1469.2857 1472.8053 1475.7359 1478.1109 1480.0692 1574.3561 1604.7326 2943.1174 2948.9822 2974.6282 3004.9747 3016.7775 3025.3276 3034.9702 3042.1493 3054.8924 3055.9861 3063.2041 3065.4396 3069.9322 3070.3415 3085.1670 3101.7171 3119.2149 3122.6723 3146.1832 3154.4531
redmass: 3.3038 1.2280 2.7172 4.5589 3.4316 4.1335 3.9978 4.8971 3.7662 4.8734 3.6947 2.3748 3.3297 3.4577 3.4207 3.5408 3.0756 3.1616 2.1281 2.7073 3.8960 5.6188 6.0630 3.8736 5.0229 3.3338 4.1511 4.3892 3.6684 4.8846 3.3715 1.4015 2.8973 1.2494 3.6270 2.7395 2.4612 2.3634 3.1379 1.7148 1.3103 3.1074 1.3910 1.6713 1.4118 1.9089 3.8915 2.2484 1.3931 1.5618 1.5415 2.6675 2.9589 1.7349 1.3067 1.1283 1.2424 1.6131 1.2079 1.5095 1.2083 1.6730 1.2008 2.8717 1.2256 1.4417 1.3204 1.5361 1.3966 1.4503 1.3189 1.4284 1.3185 1.5432 1.5325 1.2994 4.8397 3.2869 1.2260 1.0861 1.0842 1.0911 1.0531 1.1238 1.4741 1.5043 6.1783 6.2431 1.0673 1.0689 1.0386 1.0613 1.0848 1.0607 1.0876 1.0871 1.0887 1.0948 1.0951 1.0964 1.1004 1.0951 1.0998 1.1064 1.0880 1.0886 1.0959 1.0964
irintensity: 0.2128 0.4100 0.2719 0.0051 0.7729 1.2832 1.4176 0.8222 15.0615 0.5300 0.5330 1.6379 0.6547 0.1584 0.6326 0.1236 0.3325 0.2712 1.6750 28.4415 1.1863 6.2129 0.9650 7.1960 10.1130 1.0687 2.8012 0.9624 0.7216 1.7347 0.2543 50.3744 1.1437 0.6205 22.9164 2.6334 9.9540 6.4240 4.2931 2.9986 1.1277 19.5735 0.2056 2.3837 0.0996 15.5904 14.4982 3.9345 4.5682 18.2793 11.3116 19.7637 4.0481 6.9082 11.7063 1.7450 2.2929 4.7018 2.7502 3.4022 1.1601 1.2893 5.0106 4.2254 20.7337 2.1183 13.3165 2.0934 2.1670 1.8786 1.5103 10.5840 1.6951 3.4041 0.5114 0.4996 0.1580 2.8013 10.8442 7.9467 3.8314 14.0231 13.0332 17.7593 24.6129 30.1914 0.5317 1.0348 63.0675 121.1394 38.5893 21.4153 24.1625 20.9930 46.0149 19.1586 35.0026 24.8567 45.3859 13.5237 45.1464 4.0411 17.6402 17.9040 13.0125 21.2393 19.6634 3.5478
temp: 298.150 k
press: 1.00000 atm
elementType: 16 8 6 6 6 6 6 6 6 6 6 6 6 6 6 6 6 6 1 1 1 1 1 1 1 1 1 1 1 1 1 1 1 1 1 1 1 1
symmnumber: 1
zpe: 839609.8 jmol-1
zpe.correction: 0.319790 hartree
zpe.thermalcorrener: 0.335369 hartree
zpe.thermalcorrenthalpy: 0.336313 hartree
zpe.thermalcorrgfe: 0.273009 hartree
zpe.sumelectzpe: -1093.626459 hartree
zpe.sumelectthermal: -1093.610880 hartree
zpe.sumelectthermalent: -1093.609936 hartree
zpe.sumelectthermalfe: -1093.673241 hartree
dipole: -2.0264 2.7783 1.5070
dipole: 3.7545
quadrupole: -118.9214 -116.7145 -107.4774
quadrupole: -3.3907 3.8350 -1.5933
quadrupole: -4.5503 -2.3434 6.8937 -3.3907 3.8350 -1.5933
hfenergy: -1093.9462494 hartree
pointgroup: C01 [X(C16H20O1S1)]
dipole: -0.7920609 -1.2037265 -0.3249805 debye
polarizability: 253.035984|19.4330035|145.1423205|-5.5298024|2.5775155|158.6192181 unknown
InChI: InChI=1S/C16H20OS/c1-10-2-4-12(5-3-10)18-16-7-11-6-13(16)15-9-17-8-14(11)15/h2-5,11,13-16H,6-9H2,1H3
charge 0 multiplicity 1
38 atoms
S  -0.677095 1.811944 -0.047502
O  5.141904 -0.052906 0.044585
C  2.013897 0.984713 -0.379036
C  2.088592 -0.626781 1.230527
C  2.950275 -0.09705 -1.008771
C  3.007859 -1.216633 0.117458
C  2.37585 0.899939 1.132739
C  0.573407 0.395508 -0.396631
C  0.615715 -0.700533 0.722307
C  4.426554 0.342791 -1.186917
C  4.511265 -1.317601 0.478914
C  -2.254501 0.8570 -0.079074
C  -2.757638 0.326507 -1.291031
C  -2.997239 0.691085 1.113134
C  -3.982716 -0.375624 -1.302426
C  -4.230906 0.000787 1.089122
C  -4.739724 -0.552256 -0.113806
C  -6.046786 -1.326001 -0.127982
H  2.096706 1.972881 -0.860892
H  2.237659 -1.09083 2.219739
H  2.539688 -0.469572 -1.964754
H  2.626267 -2.193338 -0.231275
H  1.701761 1.505386 1.763132
H  3.425209 1.163026 1.340383
H  0.29625 -0.006622 -1.385898
H  0.351314 -1.700586 0.332467
H  -0.092875 -0.461312 1.534357
H  4.881034 -0.164159 -2.06522
H  4.559167 1.433352 -1.289701
H  4.703674 -1.407002 1.561859
H  4.985587 -2.17382 -0.047251
H  -2.201848 0.480583 -2.22272
H  -2.613615 1.109133 2.049786
H  -4.362913 -0.77941 -2.248961
H  -4.801887 -0.112256 2.018888
H  -6.735531 -0.973048 0.659607
H  -6.56246 -1.233353 -1.1001
H  -5.8717 -2.405341 0.048643
