program: Gaussian 09
title: 000022179
version: EM64L-G09RevD.01
frameworkgroup: C1[X(C18H19NO4)]
method: RPBEPBE
basis: SDD
operation: Freq
keyword: #p
keyword: freq=noraman
keyword: PBEPBE/SDD
title: #p freq=noraman PBEPBE/SDD
converged: YES YES NO NO
title: Mulliken charges:
elementType: O O O O N C C C C C C C C C C C C C C C C C C H H H H H H H H H H H H H H H H H H H
charge: -0.316640 -0.448614 -0.325556 -0.430136 -0.335260 -0.233400 0.069451 -0.667331 0.418500 0.124342 -0.514285 0.440937 -0.441476 0.171926 0.020287 -0.635870 0.209720 -0.621862 -0.481741 0.185140 0.128770 -0.519851 -0.523418 0.225238 0.246035 0.219839 0.259105 0.204397 0.235215 0.191038 0.216001 0.223487 0.259933 0.313146 0.357433 0.217835 0.219439 0.263342 0.379156 0.237690 0.230558 0.227481
chargesum: 0.00000
title: Mulliken charges with hydrogens summed into heavy atoms:
elementType: O O O O N C C C C C C C C C C C C C C C C C C
charge: -0.316640 -0.091181 -0.325556 -0.050979 -0.076155 -0.008162 0.069451 -0.201457 0.418500 0.124342 -0.074673 0.440937 -0.034437 0.171926 0.020287 -0.412384 0.209720 -0.361930 -0.168595 0.185140 0.128770 0.180764 0.172311
polarizability: 3.15732700e+02 7.38613228e+00 2.49726866e+02 -2.99048346e+00 -8.41330830e+00 1.20856262e+02
1716.lowfreq: -7.0022 -2.6754 -0.0006 0.0004 0.0005 7.5722 41.2204 50.4742 69.9225
frequency: 41.2086 50.4700 69.8960 82.3017 98.7806 105.8120 114.5783 145.0067 175.7025 180.8895 201.8245 225.6207 234.0871 242.1464 278.0596 286.2838 288.2730 308.5653 314.8369 331.8064 335.8779 373.7242 381.9746 402.7931 411.8904 434.6016 450.1373 493.1977 494.7112 501.2433 507.2315 527.0406 538.5888 595.9255 608.3321 632.4069 654.8737 666.0120 673.5025 717.8502 728.6154 748.3050 760.0918 774.0656 799.6976 825.3835 856.1737 869.3644 884.9142 908.6368 922.6074 971.0855 981.5497 985.7042 1002.2620 1049.3688 1054.9299 1080.2549 1106.7836 1112.3828 1117.2012 1143.5023 1150.9079 1153.1183 1159.9164 1169.6069 1175.2248 1185.7223 1198.8749 1216.2155 1219.4855 1225.5497 1229.4767 1263.3310 1271.9998 1284.6050 1300.9059 1313.0717 1322.9848 1346.7045 1371.8015 1382.0460 1398.6387 1406.7694 1427.7125 1437.3891 1443.9013 1445.6809 1451.3526 1454.6334 1456.1048 1463.9208 1475.0747 1476.0525 1482.9051 1485.7957 1508.8422 1586.5436 1591.3620 1602.3660 1628.5381 2807.1636 2866.4158 2968.3427 2973.4963 2975.8942 2976.6506 3030.0298 3033.5941 3043.8341 3058.1454 3082.3652 3097.7380 3117.2226 3125.2804 3152.3542 3193.9603 3452.0224 3508.4798 3582.7656
redmass: 3.7504 4.6266 3.0805 3.1423 2.6610 3.4135 4.2270 1.6028 2.2383 3.3553 3.8341 3.0258 1.5838 4.0064 4.0287 3.5700 4.9345 3.2295 5.4575 1.1449 4.3352 5.3312 5.2961 5.0848 5.5404 3.7888 2.9979 3.5304 4.7240 2.9755 1.1054 3.5522 3.6885 4.8950 4.9312 2.9824 3.6397 6.1935 5.9908 3.1752 3.2221 5.6809 3.0996 4.5371 4.3027 1.6041 3.7618 1.4848 1.4398 2.4682 3.6156 3.0704 3.7954 3.8700 3.2541 2.4249 3.6110 2.3325 2.9577 1.2370 1.2575 1.8049 1.7436 1.3643 1.3913 2.1476 1.8368 1.6508 1.2372 1.5307 2.4370 1.5188 1.6975 1.5589 2.5524 1.3763 2.0073 1.5741 1.5870 3.5431 4.0383 1.7335 4.7154 3.4095 1.3508 1.5318 1.1554 1.4391 2.1197 1.0931 1.0945 1.0507 1.1426 1.0977 1.0820 2.7002 3.3336 7.0164 7.5140 7.7579 7.2209 1.0787 1.0714 1.0321 1.0599 1.0565 1.0344 1.0998 1.1012 1.0908 1.1042 1.1013 1.0910 1.1042 1.1008 1.0920 1.0907 1.0750 1.0644 1.0660
irintensity: 2.9461 0.3263 4.3324 2.3313 3.2291 1.0241 1.9679 1.2077 1.1263 3.1882 8.6919 2.5195 1.2060 0.2587 4.4343 1.0057 1.9247 3.5023 8.2343 107.0271 16.9212 3.3191 0.4200 2.4829 2.6061 4.0527 3.8241 18.9403 11.9293 16.1777 138.3197 21.3037 7.6294 36.7955 11.1950 44.0855 11.5999 4.3017 2.2401 13.1746 7.6165 41.1276 17.9722 7.0189 11.8731 19.3782 6.8575 3.4634 44.4375 5.8097 31.5927 54.8281 16.6447 28.9080 6.8388 61.4680 125.8304 1.3849 28.6703 3.6313 0.2570 7.1483 21.9259 17.6093 22.5685 92.7367 19.7280 57.7131 10.1891 38.7287 201.1459 49.0766 66.0904 51.8979 43.7308 28.7074 75.6874 3.1758 3.7390 52.5332 32.3061 10.3899 59.2531 31.4958 1.9985 33.1900 9.2819 6.6938 21.3365 1.7806 17.9478 14.2250 98.5149 5.0648 28.5209 39.9661 112.2384 55.6011 80.7340 6.5564 16.7257 57.7343 122.2226 55.3391 32.0901 46.7858 67.0518 36.1346 30.0685 62.3713 42.2362 32.9479 20.0883 17.7752 29.2409 7.5395 9.6942 1.2250 110.8383 36.8980
temp: 298.150 k
press: 1.00000 atm
elementType: 8 8 8 8 7 6 6 6 6 6 6 6 6 6 6 6 6 6 6 6 6 6 6 1 1 1 1 1 1 1 1 1 1 1 1 1 1 1 1 1 1 1
symmnumber: 1
zpe: 879684.9 jmol-1
zpe.correction: 0.335054 hartree
zpe.thermalcorrener: 0.355718 hartree
zpe.thermalcorrenthalpy: 0.356662 hartree
zpe.thermalcorrgfe: 0.286990 hartree
zpe.sumelectzpe: -1051.261529 hartree
zpe.sumelectthermal: -1051.240865 hartree
zpe.sumelectthermalent: -1051.239921 hartree
zpe.sumelectthermalfe: -1051.309594 hartree
dipole: 2.4219 2.2499 -0.7012
dipole: 3.3792
quadrupole: -114.2509 -121.9220 -136.1161
quadrupole: -9.3804 1.1528 4.6775
quadrupole: 9.8454 2.1743 -12.0198 -9.3804 1.1528 4.6775
hfenergy: -1051.5965835 hartree
pointgroup: C01 [X(C18H19N1O4)]
dipole: 0.9508207 -0.9001827 0.2305329 debye
polarizability: 315.622852|-7.4565169|250.2435046|5.758277|0.3597069|120.4494718 unknown
InChI: InChI=1S/C18H19NO4/c1-22-15-8-11-10(7-13(15)20)5-12-16-9(3-4-19-12)6-14(21)18(23-2)17(11)16/h6-8,12,19-21H,3-5H2,1-2H3
charge 0 multiplicity 1
42 atoms
O  -0.326052 -2.595734 -0.431447
O  2.246162 -3.609754 -0.295232
O  -4.529286 -0.416101 0.329753
O  -4.656124 2.16629 -0.37621
N  2.623664 2.845777 0.002669
C  1.388255 2.063148 0.212962
C  1.65188 0.564081 0.056271
C  0.297309 2.491119 -0.786638
C  2.969954 0.053038 0.098649
C  0.520969 -0.302331 -0.125413
C  4.172594 0.976535 0.25877
C  -0.963429 1.689559 -0.517729
C  3.760348 2.353878 0.808444
C  -0.840301 0.306695 -0.173017
C  0.757067 -1.703244 -0.268665
C  3.175084 -1.341817 -0.019536
C  2.083568 -2.210078 -0.194807
C  -2.23549 2.299004 -0.586123
C  -2.024885 -0.428729 0.127334
C  -3.279812 0.192204 0.060168
C  -3.397461 1.560594 -0.308452
C  -0.335678 -3.382209 -1.684279
C  -4.517181 -1.822694 0.732475
H  0.975868 2.219424 1.246527
H  0.682755 2.314816 -1.811056
H  0.092866 3.574701 -0.6933
H  2.452289 3.852609 0.120179
H  4.92666 0.509948 0.922429
H  4.649709 1.125526 -0.729702
H  3.507597 2.259216 1.894301
H  4.59965 3.067038 0.720622
H  4.195774 -1.746262 0.032179
H  -2.336897 3.356326 -0.850275
H  -1.931807 -1.480884 0.39712
H  3.200141 -3.846835 -0.185924
H  -0.32846 -2.707527 -2.561418
H  -1.276676 -3.953938 -1.659087
H  0.528044 -4.066863 -1.716657
H  -5.338398 1.484441 -0.133999
H  -5.572128 -2.094416 0.885633
H  -3.951024 -1.959546 1.673257
H  -4.074619 -2.456704 -0.059378
