program: Gaussian 09
title: 000233467
version: EM64L-G09RevD.01
frameworkgroup: C1[X(C14H16O2)]
method: RPBEPBE
basis: SDD
operation: Freq
keyword: #pfreq=noraman
keyword: PBEPBE/SDD
title: #p freq=noraman PBEPBE/SDD
converged: YES YES NO NO
title: Mulliken charges:
elementType: O O C C C C C C C C C C C C C C H H H H H H H H H H H H H H H H
charge: -0.416975 -0.237441 -0.174788 -0.188604 -0.256046 -0.199600 -0.540097 -0.453174 -0.485894 0.402120 0.127021 -0.408659 -0.395469 -0.243299 -0.246377 -0.245719 0.238466 0.253187 0.284280 0.267302 0.230868 0.259250 0.219894 0.233900 0.216009 0.230806 0.238979 0.238966 0.374410 0.224265 0.224315 0.228105
chargesum: 0.00000
title: Mulliken charges with hydrogens summed into heavy atoms:
elementType: O O C C C C C C C C C C C C C C
charge: -0.042565 -0.237441 0.063678 0.064583 0.028234 0.067702 -0.049980 0.000620 -0.039079 0.402120 0.127021 -0.169680 -0.156503 -0.019034 -0.022062 -0.017614
polarizability: 1.74506895e+02 1.45491359e+00 1.49462457e+02 -4.45643822e+00 1.30333827e+01 1.10792614e+02
1716.lowfreq: -16.1860 -1.9758 -0.0006 -0.0005 0.0002 11.1634 32.8548 41.5540 63.5122
frequency: 32.8505 41.3348 63.4873 104.9277 117.5068 173.6629 197.8851 257.3580 294.9123 319.5163 347.5018 404.8815 411.2425 462.9693 466.7132 557.2739 584.6338 609.4745 616.5960 635.3696 699.1333 706.6119 732.5497 748.5123 770.2102 805.7100 831.9914 854.3245 861.3391 891.8076 892.7989 926.4406 933.0721 937.8628 949.1767 970.6846 977.3152 986.2062 990.5148 993.7498 1022.9847 1030.2408 1042.4494 1056.3108 1065.2586 1090.7446 1116.9040 1136.6848 1150.5363 1172.0105 1182.8272 1196.8055 1206.3528 1218.2379 1223.3018 1243.7679 1253.1632 1270.0714 1280.3386 1292.4411 1301.3357 1310.3827 1322.3132 1327.0589 1360.7945 1375.1810 1434.0389 1467.3975 1469.3125 1485.8181 1487.1691 1587.6063 1614.2325 1651.0774 2963.4296 2998.9331 3013.2101 3014.9179 3050.6803 3055.7269 3059.8009 3071.0875 3079.2852 3087.3335 3118.6331 3123.7652 3137.3156 3145.6071 3162.1577 3504.8908
redmass: 8.7105 4.0026 4.6047 4.5781 3.5316 3.8975 4.2247 2.6325 4.4099 4.8936 3.3655 2.8348 2.9734 2.2597 3.2572 3.6070 3.1714 1.5361 6.3715 5.1620 3.1837 1.9906 2.7176 2.2665 4.0993 1.4453 3.8167 1.2653 2.5236 2.2577 2.6429 1.9392 2.3343 2.9919 2.2371 1.7494 1.4377 2.1266 5.4718 1.3204 2.6452 2.1380 1.7313 1.9314 1.7691 1.5183 1.1562 1.4417 1.4014 1.0681 1.5427 1.1527 1.2465 1.6135 1.6906 1.3318 1.5698 1.3399 1.7215 1.3896 1.4955 1.6579 1.5294 1.3540 1.8178 6.4230 2.2726 1.0861 1.0856 1.6767 1.3217 5.9538 6.0175 7.9933 1.0820 1.0597 1.0620 1.0608 1.0888 1.0962 1.0914 1.0918 1.1036 1.1065 1.0844 1.0870 1.0918 1.0957 1.1015 1.0638
irintensity: 1.5220 0.1160 0.2500 0.8162 1.0710 0.1248 1.4200 1.2867 1.7212 2.2506 0.4774 0.0562 3.5745 3.7862 4.0460 32.5886 39.1813 77.4540 0.1645 1.2170 45.9116 48.2285 23.1717 27.3711 9.8796 1.5684 11.9963 0.1544 6.1011 1.5644 3.5135 1.2239 5.5806 3.7548 2.1467 13.1752 1.6876 8.3109 0.5822 0.2017 43.4957 12.9968 33.7482 203.6310 28.1471 1.4421 0.3518 1.6819 10.2678 0.0979 6.7936 1.1407 6.1303 5.1926 3.6541 7.4222 11.6684 0.9236 1.2499 5.1536 3.6376 8.7497 7.1141 0.1554 46.2224 0.5906 6.5254 13.7499 9.6039 9.6621 21.9875 2.1529 12.6349 183.0473 5.0791 26.0998 51.9416 35.8317 3.5532 24.7165 44.8153 12.4946 49.3273 37.8308 5.9192 0.0555 20.6000 44.2130 21.6232 22.5730
temp: 298.150 k
press: 1.00000 atm
elementType: 8 8 6 6 6 6 6 6 6 6 6 6 6 6 6 6 1 1 1 1 1 1 1 1 1 1 1 1 1 1 1 1
symmnumber: 1
zpe: 700964.0 jmol-1
zpe.correction: 0.266983 hartree
zpe.thermalcorrener: 0.280293 hartree
zpe.thermalcorrenthalpy: 0.281238 hartree
zpe.thermalcorrgfe: 0.225892 hartree
zpe.sumelectzpe: -692.369263 hartree
zpe.sumelectthermal: -692.355953 hartree
zpe.sumelectthermalent: -692.355009 hartree
zpe.sumelectthermalfe: -692.410354 hartree
dipole: 0.1144 -0.8311 1.2451
dipole: 1.5014
quadrupole: -88.5638 -86.1748 -101.2350
quadrupole: 0.5309 2.8940 5.5458
quadrupole: 3.4274 5.8164 -9.2438 0.5309 2.8940 5.5458
hfenergy: -692.6362461 hartree
pointgroup: C01 [X(C14H16O2)]
dipole: 0.0603566 -0.3566866 0.4669541 debye
polarizability: 174.2023268|2.3845527|147.7091482|-6.0673706|15.2594652|112.8504917 unknown
InChI: InChI=1S/C14H16O2/c15-14(16)13-11-7-6-10(8-11)12(13)9-4-2-1-3-5-9/h1-5,10-13,15H,6-8H2
charge 0 multiplicity 1
32 atoms
O  2.328955 2.531473 0.906009
O  2.219857 1.979331 -1.343762
C  0.742428 -1.636257 -0.873368
C  2.376407 -0.760552 0.453284
C  0.247734 -0.167356 -0.653241
C  1.320725 0.410215 0.352368
C  2.279041 -1.409942 -0.954828
C  0.605342 -2.454108 0.447882
C  1.746342 -1.861343 1.355496
C  -1.208834 0.031596 -0.240555
C  1.970776 1.678125 -0.153103
C  -2.214404 -0.891114 -0.634452
C  -1.613546 1.187755 0.478652
C  -3.573318 -0.670486 -0.317507
C  -2.971351 1.413417 0.797217
C  -3.959658 0.48366 0.40165
H  0.289246 -2.122557 -1.752717
H  3.373519 -0.425141 0.781933
H  0.395831 0.364762 -1.616571
H  0.9018 0.611623 1.352206
H  2.852398 -2.351105 -1.027351
H  2.578251 -0.73245 -1.773029
H  0.766621 -3.530252 0.255001
H  -0.394369 -2.343817 0.901312
H  1.364508 -1.451132 2.307313
H  2.502149 -2.629261 1.60187
H  -1.935404 -1.789811 -1.195586
H  -0.865754 1.927706 0.787902
H  2.791124 3.331763 0.533862
H  -4.329618 -1.398902 -0.63219
H  -3.256882 2.315092 1.351199
H  -5.013316 0.656169 0.648006
