program: Gaussian 09
title: 000233466
version: EM64L-G09RevD.01
frameworkgroup: C1[X(C14H14O2)]
method: RPBEPBE
basis: SDD
operation: Freq
keyword: #pfreq=noraman
keyword: PBEPBE/SDD
title: #p freq=noraman PBEPBE/SDD
converged: YES YES NO NO
title: Mulliken charges:
elementType: O O C C C C C C C C C C C C C C H H H H H H H H H H H H H H
charge: -0.415331 -0.238540 -0.258452 -0.248500 -0.276509 -0.248103 -0.555649 -0.185497 -0.237578 0.441461 0.145975 -0.390007 -0.417005 -0.244323 -0.242585 -0.245022 0.253678 0.257614 0.285956 0.296517 0.252116 0.256358 0.241658 0.242687 0.238648 0.238815 0.374615 0.224645 0.224055 0.228304
chargesum: 0.00000
title: Mulliken charges with hydrogens summed into heavy atoms:
elementType: O O C C C C C C C C C C C C C C
charge: -0.040716 -0.238540 -0.004775 0.009114 0.009448 0.048414 -0.047175 0.056161 0.005109 0.441461 0.145975 -0.151360 -0.178190 -0.019677 -0.018530 -0.016718
polarizability: 1.74040326e+02 -5.83367658e+00 1.48955396e+02 2.49726078e+00 1.08706859e+01 1.07413346e+02
1716.lowfreq: -12.4765 -2.2568 -0.0007 -0.0002 0.0004 10.0865 29.1490 39.4175 66.2044
frequency: 29.1134 39.2498 66.1686 106.6730 134.8437 176.2741 207.5031 284.8963 311.6917 334.5313 400.6072 403.4716 434.7028 487.0905 519.3802 581.6278 601.1315 616.5132 634.2381 653.6527 702.2408 705.8304 725.7709 746.7767 774.4767 798.4525 835.5039 851.5069 867.3373 891.8840 908.3796 915.0145 923.9135 936.8048 947.8209 970.1422 975.7571 987.7704 991.6780 995.2773 998.7846 1030.3760 1034.7435 1063.3600 1089.1309 1094.4818 1107.8301 1147.6085 1172.2440 1178.3009 1195.9472 1205.6949 1222.8201 1227.0980 1246.2088 1264.9833 1268.1589 1281.3348 1302.0762 1321.0934 1333.0660 1358.9369 1375.7909 1433.9547 1474.6092 1486.5121 1580.4414 1588.5984 1614.7610 1648.1481 2978.4063 3025.5661 3074.2285 3079.7248 3089.0514 3101.7913 3117.4135 3123.3607 3136.6634 3145.9958 3161.1038 3162.5523 3193.5213 3503.6859
redmass: 8.7330 3.9449 5.2799 4.8455 4.2888 4.2492 4.7856 5.8388 5.4605 4.0080 3.9347 2.8585 3.1182 2.0690 3.0106 3.5290 1.7309 6.3642 4.6619 2.5425 2.9642 1.9058 1.7630 1.9704 4.7132 4.2401 3.7786 1.2523 2.5041 3.8792 1.8749 1.8916 1.4425 2.8214 2.7663 2.5682 1.4605 2.9546 2.0081 1.7535 1.7910 2.1659 2.0304 2.0933 1.4823 1.3530 1.1429 1.4155 1.0664 1.3069 1.1393 1.4975 1.5342 1.5063 1.4624 1.8123 1.3584 1.4154 1.6678 1.4257 1.5894 1.8438 6.6834 2.2633 1.1045 2.2832 5.7626 5.9927 6.0580 7.9240 1.0825 1.0596 1.0859 1.0886 1.0922 1.1069 1.0854 1.0865 1.0918 1.0956 1.0878 1.1011 1.1095 1.0638
irintensity: 1.6496 0.0126 0.2890 0.7142 1.3846 0.0578 1.0872 3.4760 2.0977 2.6463 3.0933 0.1553 4.3101 2.8438 17.6110 23.5148 77.2510 0.1984 11.3503 38.7455 38.6635 71.5725 50.6890 36.0856 5.8911 9.4863 11.5311 0.0136 8.8543 8.4008 2.6072 5.2842 2.8032 12.1130 2.5893 8.5840 1.1591 5.1948 2.9876 7.2725 1.0339 9.1316 142.7572 180.0058 0.8137 6.7877 1.7128 2.2057 0.0880 1.3600 0.6697 16.2764 4.3948 3.3509 1.0675 10.5835 1.3657 3.2385 12.3811 4.6736 8.9115 63.6286 0.2933 6.9228 17.4118 23.4219 1.4494 2.0285 12.4119 189.4374 4.8756 27.5226 7.6612 47.3622 11.2516 21.0149 7.1897 0.1470 20.3745 43.0379 3.6508 22.9200 15.2260 25.1868
temp: 298.150 k
press: 1.00000 atm
elementType: 8 8 6 6 6 6 6 6 6 6 6 6 6 6 6 6 1 1 1 1 1 1 1 1 1 1 1 1 1 1
symmnumber: 1
zpe: 638302.6 jmol-1
zpe.correction: 0.243117 hartree
zpe.thermalcorrener: 0.256076 hartree
zpe.thermalcorrenthalpy: 0.257020 hartree
zpe.thermalcorrgfe: 0.202314 hartree
zpe.sumelectzpe: -691.162822 hartree
zpe.sumelectthermal: -691.149863 hartree
zpe.sumelectthermalent: -691.148919 hartree
zpe.sumelectthermalfe: -691.203625 hartree
dipole: 0.2289 -0.3327 1.1137
dipole: 1.1846
quadrupole: -87.5705 -85.8847 -98.7313
quadrupole: -2.9056 -3.5404 4.6722
quadrupole: 3.1583 4.8441 -8.0024 -2.9056 -3.5404 4.6722
hfenergy: -691.4059391 hartree
pointgroup: C01 [X(C14H14O2)]
dipole: -0.0699636 -0.1746188 -0.4264136 debye
polarizability: 173.385851|7.4062712|146.9471024|4.5730239|-14.2805064|110.0761144 unknown
InChI: InChI=1S/C14H14O2/c15-14(16)13-11-7-6-10(8-11)12(13)9-4-2-1-3-5-9/h1-7,10-13,15H,8H2
charge 0 multiplicity 1
30 atoms
O  2.337661 2.501522 -0.944523
O  2.398842 1.889798 1.291649
C  0.741064 -1.63874 0.908539
C  2.340373 -0.841274 -0.497774
C  0.260144 -0.145437 0.668102
C  1.321855 0.392549 -0.367496
C  2.284005 -1.414062 0.949418
C  0.597005 -2.391143 -0.420824
C  1.556563 -1.911312 -1.264204
C  -1.196883 0.046802 0.254062
C  2.044359 1.627834 0.117972
C  -1.607869 1.235428 -0.406476
C  -2.192242 -0.910775 0.580323
C  -2.963462 1.458146 -0.734624
C  -3.549692 -0.693025 0.253751
C  -3.942989 0.493025 -0.406616
H  0.288896 -2.112929 1.792462
H  3.322927 -0.562701 -0.906826
H  0.421693 0.398312 1.621324
H  0.880901 0.608112 -1.352732
H  2.602881 -0.692065 1.7210
H  2.846678 -2.356807 1.047969
H  -0.19956 -3.099287 -0.661748
H  1.692917 -2.14217 -2.323736
H  -0.864465 1.999184 -0.665755
H  -1.910338 -1.834204 1.097736
H  2.847445 3.280495 -0.589503
H  -3.254375 2.383813 -1.244359
H  -4.299248 -1.449033 0.51492
H  -4.995183 0.662745 -0.66093
