program: Gaussian 09
title: 000233476
version: EM64L-G09RevD.01
frameworkgroup: C1[X(C18H21NO)]
method: RPBEPBE
basis: SDD
operation: Freq
keyword: #p
keyword: freq=noraman
keyword: PBEPBE/SDD
title: #p freq=noraman PBEPBE/SDD
converged: YES YES NO NO
title: Mulliken charges:
elementType: O N C C C C C C C C C C C C C C C C C C H H H H H H H H H H H H H H H H H H H H H
charge: -0.412813 -0.047659 -0.203569 0.477439 -0.556887 -0.003234 -0.683301 -0.680697 0.035055 0.379950 -0.514475 -0.828029 -0.605744 -0.213802 0.480855 -0.390108 -0.430688 -0.223177 -0.216911 -0.244240 0.155161 0.252438 0.222003 0.212211 0.227837 0.228826 0.211454 0.222131 0.251013 0.233645 0.229390 0.253496 0.210618 0.240906 0.230490 0.338030 0.249953 0.231350 0.226837 0.225552 0.228694
chargesum: 0.00000
title: Mulliken charges with hydrogens summed into heavy atoms:
elementType: O N C C C C C C C C C C C C C C C C C C
charge: -0.074782 -0.047659 -0.048408 0.477439 -0.304450 -0.003234 -0.021251 -0.018285 0.035055 0.379950 -0.263462 -0.111498 -0.154220 0.016688 0.480855 -0.140154 -0.199338 0.003660 0.008641 -0.015546
polarizability: 3.20839737e+02 -1.04005438e+01 1.82831054e+02 1.60063934e+01 8.48245204e+00 1.47415949e+02
1716.lowfreq: -5.9576 -1.8324 0.0003 0.0005 0.0008 8.5438 17.8761 21.7158 24.8945
frequency: 16.6932 21.3647 24.8149 35.6892 63.2124 77.7375 100.6636 156.2793 182.8168 186.5117 207.8311 210.8866 216.3015 240.7001 254.7729 263.3898 279.8321 314.0516 339.7545 358.2327 359.3337 394.8551 404.5507 421.4869 440.5656 481.4214 486.5436 511.0196 527.8631 577.2339 592.6281 617.3868 653.1735 686.8012 707.2628 720.5849 737.9289 759.3746 781.9144 802.1001 856.0848 873.8300 885.9223 894.5886 909.7569 916.4862 924.1410 955.6958 970.9947 979.3087 990.0418 996.3093 1000.7477 1026.3180 1033.4179 1039.2538 1059.0779 1086.6043 1094.3456 1116.3897 1123.9276 1157.2693 1169.1025 1171.8315 1186.9794 1190.2140 1203.0335 1208.5943 1258.1167 1277.0888 1279.1987 1281.2158 1327.5899 1329.3384 1354.0267 1381.0926 1382.1593 1382.6077 1399.9230 1400.3348 1418.1661 1440.5699 1451.7988 1465.6559 1468.5701 1472.4607 1475.5795 1479.2772 1482.0903 1483.3309 1494.2706 1560.2887 1593.1644 1609.1666 1621.8737 1642.2600 2915.7154 2971.5192 2978.5778 2979.1954 2980.9401 2988.3944 3055.8724 3062.0845 3073.1317 3078.2573 3081.8817 3084.6898 3086.0916 3116.4315 3118.4179 3133.1445 3141.5360 3143.9140 3147.7935 3162.6134 3557.4732
redmass: 3.9165 3.5522 3.5341 4.2752 5.2528 3.5419 3.7960 3.5546 3.2082 1.0956 2.3808 3.1264 1.1965 1.7195 1.8699 2.7369 3.3342 2.9720 3.7304 1.2006 2.8178 3.9961 2.8256 2.8180 3.8560 3.8600 3.3177 3.5853 3.2342 4.5209 3.8072 6.2535 4.8530 4.3732 1.7602 5.6677 3.1552 1.9233 3.5415 2.9354 1.2472 1.4479 2.5045 1.7083 1.5972 1.1810 1.5253 1.4527 1.6826 1.3851 5.9991 1.3161 1.4814 2.2351 2.5196 1.5161 2.1673 1.6634 1.9841 2.4417 1.6646 1.9364 1.9976 1.0612 1.1288 1.3183 2.4854 2.3096 1.3132 2.1805 1.9100 1.3858 1.2965 1.9869 1.5622 1.1925 4.5780 3.6097 1.2186 1.2132 3.8504 2.1307 1.1264 1.0445 1.0508 1.1247 1.1153 1.0615 2.2118 1.3410 1.8426 5.7166 6.1785 6.3257 7.3256 7.4048 1.0809 1.0719 1.0350 1.0516 1.0356 1.0615 1.0954 1.1003 1.1002 1.0997 1.1005 1.0994 1.0998 1.0864 1.0874 1.0912 1.0903 1.0960 1.0917 1.1015 1.0651
irintensity: 0.1558 0.1081 0.0092 0.1166 0.2875 1.7159 0.5514 7.5335 3.5340 0.2188 4.7389 1.6080 1.2600 3.3942 1.2850 2.0234 2.3637 4.0051 7.9419 99.7206 14.8343 0.6719 0.0918 0.9297 0.5689 15.3344 10.8260 1.6166 3.5604 2.0397 11.3697 0.4124 11.2162 4.6064 58.9398 1.4215 2.5320 34.6699 32.0118 19.6953 0.3547 9.3121 5.2964 20.5872 8.2133 0.6450 1.5987 0.1609 14.5453 0.3031 0.7229 0.1760 21.3543 8.8243 10.5229 6.3266 7.7908 13.9748 14.7087 2.5874 108.3533 64.1427 28.6051 0.2457 1.0461 0.1248 5.0790 80.0750 8.9201 1.2203 1.3454 0.7801 0.9623 43.5462 12.3415 15.7369 2.8573 2.2753 18.1288 6.7620 12.6671 5.8783 16.3539 2.3548 3.4081 11.9698 26.6137 3.3656 25.3602 13.3857 87.1511 40.5420 4.2884 30.4389 3.7288 63.2900 58.7160 19.9354 27.8710 58.1075 31.4543 24.2144 16.1827 13.2970 1.2047 98.5288 23.0715 13.7648 38.3855 8.0933 3.0933 9.9810 10.9402 41.4659 5.6897 28.3379 42.1646
temp: 298.150 k
press: 1.00000 atm
elementType: 8 7 6 6 6 6 6 6 6 6 6 6 6 6 6 6 6 6 6 6 1 1 1 1 1 1 1 1 1 1 1 1 1 1 1 1 1 1 1 1 1
symmnumber: 1
zpe: 893040.6 jmol-1
zpe.correction: 0.340141 hartree
zpe.thermalcorrener: 0.360200 hartree
zpe.thermalcorrenthalpy: 0.361145 hartree
zpe.thermalcorrgfe: 0.289106 hartree
zpe.sumelectzpe: -827.017503 hartree
zpe.sumelectthermal: -826.997444 hartree
zpe.sumelectthermalent: -826.996499 hartree
zpe.sumelectthermalfe: -827.068538 hartree
dipole: 0.2144 -0.7656 -0.7916
dipole: 1.1219
quadrupole: -99.1601 -121.9420 -117.8775
quadrupole: -9.9521 4.4847 3.8358
quadrupole: 13.8331 -8.9488 -4.8843 -9.9521 4.4847 3.8358
hfenergy: -827.3576441 hartree
pointgroup: C01 [X(C18H21N1O1)]
dipole: 0.077933 -0.3293536 -0.283362 debye
polarizability: 320.4758639|-11.5146132|184.445355|16.8421854|4.8851898|146.165521 unknown
InChI: InChI=1S/C18H21NO/c1-13(2)16-12-17(14(3)11-18(16)20)19-10-9-15-7-5-4-6-8-15/h4-8,10-13,20H,9H2,1-3H3
charge 0 multiplicity 1
41 atoms
O  4.604013 2.043814 -0.494754
N  -0.16977 -0.940717 0.116239
C  4.783214 -0.901141 0.23732
C  3.478227 -0.131367 0.001478
C  2.23157 -0.777595 0.139855
C  3.447219 1.251856 -0.336699
C  4.960192 -2.053392 -0.78719
C  4.880352 -1.42607 1.694893
C  0.990433 -0.129533 -0.084435
C  0.9764 1.270886 -0.401439
C  2.220675 1.929337 -0.509401
C  -0.298577 2.086011 -0.560841
C  -2.440701 -1.736505 -0.366499
C  -1.212147 -0.897168 -0.663866
C  -3.66069 -0.860919 -0.072352
C  -3.694386 -0.06053 1.100138
C  -4.765313 -0.815058 -0.958789
C  -4.809061 0.759178 1.381805
C  -5.882343 0.007495 -0.681217
C  -5.907747 0.797467 0.490415
H  5.651323 -0.218152 0.092718
H  2.190406 -1.833316 0.429286
H  4.150054 -2.797636 -0.681594
H  5.922697 -2.574141 -0.627503
H  4.934625 -1.674304 -1.824456
H  4.800515 -0.599712 2.423467
H  5.841569 -1.94781 1.858984
H  4.065399 -2.141288 1.908303
H  2.257457 3.0011 -0.731864
H  -0.113884 3.138916 -0.285638
H  -0.667112 2.082761 -1.60448
H  -1.118634 1.704631 0.072636
H  -2.657934 -2.385587 -1.237389
H  -2.200365 -2.385219 0.494911
H  -1.26702 -0.262604 -1.571723
H  5.418295 1.500595 -0.346733
H  -2.844393 -0.088244 1.793369
H  -4.75382 -1.430093 -1.867352
H  -4.822892 1.366665 2.294014
H  -6.730042 0.028733 -1.375638
H  -6.772898 1.433756 0.708123
