program: Gaussian 09
title: 000233463
version: EM64L-G09RevD.01
frameworkgroup: C1[X(C12H14O3)]
method: RPBEPBE
basis: SDD
operation: Freq
keyword: #pfreq=noraman
keyword: PBEPBE/SDD
title: #p freq=noraman PBEPBE/SDD
converged: YES YES NO NO
title: Mulliken charges:
elementType: O O O C C C C C C C C C C C C H H H H H H H H H H H H H H
charge: -0.197899 -0.164030 -0.164027 -0.350147 -0.350163 -0.256990 -0.256953 0.344259 -0.464533 -0.464575 0.163481 0.163448 0.129692 -0.776664 -0.776690 0.285060 0.285060 0.279722 0.279706 0.212577 0.243368 0.243377 0.212584 0.233834 0.222609 0.233718 0.222744 0.233625 0.233808
chargesum: 0.00000
title: Mulliken charges with hydrogens summed into heavy atoms:
elementType: O O O C C C C C C C C C C C C
charge: -0.197899 -0.164030 -0.164027 -0.065087 -0.065104 0.022732 0.022754 0.344259 -0.008588 -0.008614 0.163481 0.163448 0.129692 -0.086503 -0.086513
polarizability: 1.21365951e+02 -8.23192976e+00 1.31724325e+02 -2.28048306e-02 1.89032285e-03 1.31070448e+02
1716.lowfreq: -15.6316 -12.1612 -3.8028 -0.0007 -0.0004 0.0008 42.6303 55.3432 95.7901
frequency: 42.6160 55.3300 95.7223 113.6553 133.7978 156.1295 177.7107 193.8171 195.9537 258.7268 280.7759 348.3828 401.6339 415.7712 450.1996 475.1708 534.8323 556.5109 574.3349 617.8264 624.1883 687.4721 733.1443 783.1962 794.4450 818.9764 822.2374 850.7221 879.9520 894.4410 905.6070 924.4182 941.1239 949.7419 971.6671 996.1044 1024.2499 1030.4680 1066.4108 1081.1989 1083.9852 1110.8078 1115.3574 1144.8441 1159.2112 1160.0113 1185.2939 1202.4646 1215.8424 1240.7989 1246.1875 1257.5195 1279.2791 1289.6191 1296.9918 1311.2871 1390.2127 1401.9140 1454.2986 1464.9254 1465.3932 1471.0695 1474.2275 1481.4776 1694.0458 1740.3820 1763.4360 2968.1340 2971.9906 3003.3104 3016.9783 3038.5784 3041.7600 3046.1337 3059.9704 3061.7379 3084.4981 3096.0272 3100.0051 3104.3469 3109.4316
redmass: 7.2669 4.3047 1.4711 1.5046 11.5288 1.2552 3.0882 2.9905 3.0208 2.3439 4.1009 3.7159 3.0866 3.5051 3.8345 5.0337 3.8990 4.4044 11.8063 7.4194 6.9461 3.6033 6.6338 5.0359 2.6902 2.5657 9.1312 3.3351 2.4981 2.3866 2.5498 3.0785 1.9395 1.4527 1.3647 1.8726 2.0141 2.6436 2.5721 1.6128 1.3687 3.9132 2.4393 2.2594 1.4943 1.5850 1.4818 1.1984 1.6160 1.3763 2.1999 1.6495 1.5120 1.5201 1.6185 1.5849 1.2485 1.2043 1.0495 1.0513 1.0774 1.0446 1.0763 1.0876 12.9606 8.3626 12.6920 1.0384 1.0384 1.0594 1.0627 1.0972 1.0965 1.0850 1.0870 1.1041 1.1043 1.0957 1.0967 1.0897 1.0922
irintensity: 0.5122 3.5817 0.1911 0.0842 2.4388 0.6260 0.5281 2.0631 1.0519 1.3226 1.9588 2.9060 10.4342 1.8901 0.0322 0.4923 2.1231 26.3946 2.5071 1.3481 4.1471 3.1584 10.4379 43.6393 1.1912 10.5443 231.0171 6.3767 7.3949 28.5878 4.4024 1.4177 8.5621 2.1253 1.1265 6.4101 9.1307 2.1115 84.9988 0.5338 10.8829 1.4752 72.2992 117.1459 0.3215 14.7898 3.3026 0.0002 0.7816 0.6263 1.0953 0.7806 0.4245 0.1900 2.1595 5.0209 28.5020 8.9784 0.8276 7.7297 7.8032 25.4000 12.2993 4.9878 452.6872 10.2032 105.3641 16.8804 55.8054 30.5782 63.1808 0.0460 37.5130 5.2290 12.0531 0.0465 52.6529 3.3226 24.9821 45.3720 2.3856
temp: 298.150 k
press: 1.00000 atm
elementType: 8 8 8 6 6 6 6 6 6 6 6 6 6 6 6 1 1 1 1 1 1 1 1 1 1 1 1 1 1
symmnumber: 1
zpe: 614057.8 jmol-1
zpe.correction: 0.233882 hartree
zpe.thermalcorrener: 0.247552 hartree
zpe.thermalcorrenthalpy: 0.248496 hartree
zpe.thermalcorrgfe: 0.193344 hartree
zpe.sumelectzpe: -690.227678 hartree
zpe.sumelectthermal: -690.214009 hartree
zpe.sumelectthermalent: -690.213064 hartree
zpe.sumelectthermalfe: -690.268216 hartree
dipole: 3.9398 4.2054 -0.0043
dipole: 5.7626
quadrupole: -91.0985 -86.1782 -98.2612
quadrupole: -11.4421 0.0304 -0.0317
quadrupole: 0.7475 5.6678 -6.4153 -11.4421 0.0304 -0.0317
hfenergy: -690.4615603 hartree
pointgroup: C01 [X(C12H14O3)]
dipole: 1.7218141 1.4749316 -0.0087566 debye
polarizability: 119.6988878|-6.9077837|133.3914191|0.0174574|0.0133779|131.0704173 unknown
InChI: InChI=1S/C12H14O3/c1-5(2)8-6-3-4-7(8)10-9(6)11(13)15-12(10)14/h6-7,9-10H,3-4H2,1-2H3
charge 0 multiplicity 1
29 atoms
O  -2.130305 -0.960351 0.007825
O  -1.949123 -0.699726 -2.305505
O  -1.943994 -0.679986 2.318451
C  0.637706 0.839054 -1.15142
C  0.641214 0.847608 1.144127
C  -0.887337 0.970974 -0.782771
C  -0.884945 0.977181 0.779108
C  1.13596 -0.044177 -0.001104
C  1.299912 2.210109 -0.798318
C  1.302521 2.215972 0.778819
C  -1.685329 -0.266126 -1.181285
C  -1.682213 -0.256335 1.189974
C  1.794948 -1.232763 0.002255
C  2.189654 -1.950126 1.283014
C  2.186049 -1.959294 -1.274439
H  0.803935 0.497886 -2.182365
H  0.810462 0.513998 2.177048
H  -1.340706 1.860189 -1.252432
H  -1.336361 1.870365 1.243056
H  0.743797 3.063032 -1.227758
H  2.328585 2.245273 -1.196254
H  2.332531 2.253855 1.17304
H  0.747998 3.072164 1.20378
H  1.717787 -2.951155 1.325092
H  3.284677 -2.114384 1.316188
H  1.896533 -1.399929 2.191223
H  3.28173 -2.118083 -1.312569
H  1.719243 -2.963094 -1.304983
H  1.884773 -1.418632 -2.185699
