program: Gaussian 09
title: 000233459
version: EM64L-G09RevD.01
frameworkgroup: C1[X(C10H15N)]
method: RPBEPBE
basis: SDD
operation: Freq
keyword: #pfreq=noraman
keyword: PBEPBE/SDD
title: #p freq=noraman PBEPBE/SDD
converged: YES YES NO NO
title: Mulliken charges:
elementType: N C C C C C C C C C C H H H H H H H H H H H H H H H
charge: -0.044022 -0.169744 -0.169750 -0.260761 -0.260757 -0.531877 -0.480952 -0.480952 -0.229051 -0.229047 -0.630139 0.257822 0.257821 0.243601 0.243601 0.221549 0.251310 0.219611 0.225915 0.225913 0.219613 0.236529 0.236528 0.195479 0.225880 0.225881
chargesum: 0.00000
title: Mulliken charges with hydrogens summed into heavy atoms:
elementType: N C C C C C C C C C C
charge: -0.044022 0.088077 0.088071 -0.017160 -0.017156 -0.059018 -0.035426 -0.035426 0.007478 0.007480 0.017101
polarizability: 1.15261561e+02 -4.41202481e-04 1.01754281e+02 8.08299990e-01 3.78112630e-04 8.75230153e+01
1716.lowfreq: -28.5183 -8.0096 -0.0006 -0.0005 -0.0002 12.4722 102.6004 146.2278 211.1763
frequency: 102.5944 146.1698 211.1702 240.1072 264.2547 344.0229 417.7206 426.8652 447.1333 497.1900 589.5994 629.5566 669.7246 708.8217 759.5302 765.8543 796.2761 825.7456 887.0298 892.0353 901.1280 918.4027 937.8084 950.8036 956.9879 984.1669 993.1241 1007.0895 1017.1057 1033.3716 1036.6361 1065.4721 1090.6467 1103.7605 1118.3161 1141.4438 1150.8611 1172.4326 1225.3191 1226.2131 1233.1324 1250.8499 1252.1317 1259.2692 1280.7167 1288.4936 1310.6128 1312.5160 1313.6095 1320.4278 1425.7162 1465.6203 1465.9953 1468.5377 1480.6224 1488.2958 1580.4580 2870.4208 2980.6313 2984.6160 3019.5032 3023.0568 3023.4389 3038.4095 3061.7497 3066.9005 3070.1112 3075.4320 3079.9322 3091.6512 3151.7502 3185.3510
redmass: 2.8713 2.5915 1.0387 3.5112 3.1695 2.5528 2.1076 2.5655 2.5818 1.9392 3.2845 3.5266 2.5400 1.7446 4.1701 4.0443 2.7267 4.4669 2.4448 2.4641 2.3382 1.4469 2.4918 2.3382 1.7565 2.2372 2.0930 1.7952 1.6436 2.0251 2.3137 1.7764 1.3112 1.1742 1.3823 1.6303 1.4569 1.9699 1.3796 1.4894 1.4042 1.5773 1.4481 1.3342 1.2850 1.4458 1.3601 1.4434 1.7222 1.4116 1.1470 1.0786 1.1007 1.0524 1.0471 1.0946 5.7693 1.0546 1.0639 1.0666 1.0601 1.0742 1.0861 1.0882 1.0998 1.0880 1.0991 1.0932 1.1004 1.1050 1.0869 1.1096
irintensity: 1.2837 0.2338 0.0992 1.7646 0.0790 3.2318 8.2959 0.6193 0.0123 3.4891 12.9041 0.1461 1.5146 67.7821 9.3245 1.5849 21.7082 3.5153 0.9755 7.0350 2.7248 1.0549 4.3740 13.2669 0.2236 8.8963 2.6104 12.0491 4.6249 0.5051 3.5703 20.2273 4.0433 0.0272 11.9157 0.0249 3.2912 0.0643 1.4016 2.5097 0.3392 2.1771 6.2360 0.6692 0.0327 0.4857 0.0180 2.0011 14.5254 6.6095 2.4106 11.6526 2.7304 21.3872 4.0172 15.3840 3.5913 103.8832 52.6616 31.8257 38.6335 53.7949 1.5941 28.4124 11.2505 72.9094 82.5559 5.5506 46.7553 27.8470 7.9877 25.7139
temp: 298.150 k
press: 1.00000 atm
elementType: 7 6 6 6 6 6 6 6 6 6 6 1 1 1 1 1 1 1 1 1 1 1 1 1 1 1
symmnumber: 1
zpe: 601556.8 jmol-1
zpe.correction: 0.229121 hartree
zpe.thermalcorrener: 0.238071 hartree
zpe.thermalcorrenthalpy: 0.239015 hartree
zpe.thermalcorrgfe: 0.195661 hartree
zpe.sumelectzpe: -443.907113 hartree
zpe.sumelectthermal: -443.898164 hartree
zpe.sumelectthermalent: -443.897220 hartree
zpe.sumelectthermalfe: -443.940574 hartree
dipole: -0.3954 0.0000 -1.1208
dipole: 1.1885
quadrupole: -71.2008 -63.4496 -67.7801
quadrupole: -0.0001 -3.0571 0.0000
quadrupole: -3.7239 4.0272 -0.3033 -0.0001 -3.0571 0.0000
hfenergy: -444.1362344 hartree
pointgroup: C01 [X(C10H15N1)]
dipole: 0.1617616 0.0001024 -0.4387153 debye
dipolederiv: -0.7583301 -0.0000138 -0.0602567 -0.0000767 -0.3328761 0.0000229 0.1931864 0.0000354 -0.4547568 -0.075828 0.0298916 0.0202014 -0.0952144 -0.0918664 0.0595071 0.1126341 0.106745 0.0520381 -0.075845 -0.0299074 0.0202 0.0951734 -0.0917897 -0.0595584 0.1126898 -0.1067885 0.0519784 -0.0045608 -0.0508676 0.0731153 0.0001407 0.1769753 -0.0532732 0.0671005 -0.1089595 0.0268388 -0.0045747 0.0508257 0.0731269 -0.0001815 0.1769253 0.0533318 0.0670927 0.109018 0.0268922 0.1258136 0.0000132 -0.0053704 0.0000216 -0.1069965 -0.0000205 -0.0431342 -0.0000242 0.0339882 0.3243217 -0.04942 0.0243878 -0.1119501 0.2644765 -0.042873 -0.1113822 -0.0926842 0.2281879 0.3243188 0.0494209 0.0244021 0.1120103 0.264438 0.0428891 -0.1113555 0.0926839 0.2282393 -0.1071124 0.0596161 -0.1851951 0.1282189 -0.0284282 -0.0128785 -0.2214601 0.0720095 -0.0720057 -0.1070801 -0.0595585 -0.185222 -0.1281606 -0.0284328 0.0128674 -0.2214979 -0.07201 -0.0720238 0.3848392 -0.0000007 0.0878108 -0.0000048 0.0890912 -0.0000591 0.1031398 -0.0000564 0.3990567 0.0148494 -0.005303 -0.0156425 -0.0031945 0.01143 -0.0585005 -0.0165841 -0.0851818 -0.1315322 0.0148504 0.0053138 -0.0156562 0.0032095 0.0113776 0.0585532 -0.016602 0.0852332 -0.1314786 0.0475004 0.0077602 0.0012467 0.023422 -0.1620926 0.0649976 -0.0131444 0.0790912 0.0408113 0.0475057 -0.0077398 0.0012513 -0.0233987 -0.162048 -0.0650651 -0.0131412 -0.0791628 0.0407632 -0.0395259 -0.0000357 0.1685633 -0.0000342 0.0790801 0.0000264 0.148093 0.0000284 -0.0483848 -0.1239275 0.0000137 -0.1475581 0.0000048 0.0652066 0.0000023 -0.0870863 0.0000029 0.0047911 -0.0268589 -0.1068783 -0.0170073 -0.0916031 -0.0968539 -0.0348933 -0.043096 -0.0977892 0.0559009 -0.0100387 0.0684974 -0.0882972 0.0566578 0.0401018 0.0264201 -0.0584852 0.0895242 -0.1369221 -0.0100244 -0.0684687 -0.0883246 -0.0566422 0.0401367 -0.0263538 -0.0585014 -0.089453 -0.1369686 -0.0268845 0.106897 -0.0169656 0.0916302 -0.0968859 0.0348255 -0.0430696 0.097718 0.0559586 0.0686006 0.042777 0.1121734 0.0644232 0.026199 -0.0753004 0.1570733 -0.0769142 0.0440476 0.0686161 -0.042813 0.1121509 -0.0644662 0.0261356 0.0753103 0.1570394 0.0769232 0.0440932 -0.0239505 -0.0000319 0.1321012 0.0000007 0.0672474 0.0000792 -0.0244948 0.0000694 -0.280144 -0.0133538 0.1029648 -0.0125977 0.1881789 -0.0702592 0.0200855 -0.0174671 -0.0162849 0.0653165 -0.0133206 -0.1029532 -0.0126377 -0.1881649 -0.0702918 -0.0201428 -0.0175468 0.0162265 0.0653146 unknown
polarizability: 115.2788637|0.0004784|101.7542808|-0.4160478|0.0023347|87.5057129 unknown
InChI: InChI=1S/C10H15N/c1-11-5-9-7-2-3-8(4-7)10(9)6-11/h2-3,7-10H,4-6H2,1H3
charge 0 multiplicity 1
26 atoms
N  -2.388317 -0.000286 0.412625
C  -0.190908 -0.790716 -0.385101
C  -0.19102 0.790753 -0.384801
C  1.197149 -1.140453 0.283291
C  1.197014 1.140422 0.28367
C  1.310987 -0.000186 1.345597
C  -1.465016 -1.177115 0.441783
C  -1.465161 1.176644 0.442277
C  2.276809 -0.682305 -0.712829
C  2.276696 0.682727 -0.712633
C  -3.292462 -0.000096 -0.763869
H  -0.244176 -1.205711 -1.406226
H  -0.244384 1.206135 -1.405764
H  1.278304 -2.177273 0.646092
H  1.278059 2.177131 0.646817
H  0.496573 -0.000355 2.091033
H  2.284128 -0.000216 1.864315
H  -1.977729 -2.07162 0.047516
H  -1.187275 -1.385566 1.49356
H  -1.187426 1.38468 1.494138
H  -1.977991 2.071253 0.048398
H  2.85436 -1.348264 -1.360003
H  2.85415 1.348967 -1.359606
H  -2.774239 0.000137 -1.754763
H  -3.943617 0.891055 -0.720027
H  -3.943512 -0.891342 -0.720393
