program: Gaussian 09
title: 000233456
version: EM64L-G09RevD.01
frameworkgroup: C1[X(C9H13ClO)]
method: RPBEPBE
basis: SDD
operation: Freq
keyword: #p
keyword: freq=noraman
keyword: PBEPBE/SDD
title: #p freq=noraman PBEPBE/SDD
converged: NO YES NO NO
title: Mulliken charges:
elementType: Cl O C C C C C C C C C H H H H H H H H H H H H H
charge: -0.089887 -0.235007 -0.176818 -0.197936 -0.148838 -0.126716 -0.514034 -0.415217 -0.456456 -0.379151 -0.384330 0.279277 0.248166 0.232749 0.227512 0.280712 0.240463 0.277779 0.267793 0.212860 0.233006 0.196000 0.196961 0.231113
chargesum: 0.00000
title: Mulliken charges with hydrogens summed into heavy atoms:
elementType: Cl O C C C C C C C C C
charge: -0.089887 -0.235007 0.102459 0.050230 0.083911 0.100796 0.007141 -0.137438 0.024196 0.049855 0.043744
polarizability: 1.18948471e+02 2.94170848e+00 9.23993153e+01 -4.90947919e+00 -1.85593145e-01 8.33205715e+01
1716.lowfreq: -19.2081 -15.3682 -0.0009 -0.0004 0.0007 13.9563 76.4788 133.2257 167.1434
frequency: 76.4082 133.2105 167.1284 210.2503 262.9155 282.1577 329.6991 395.4671 473.0563 534.1213 615.2531 684.3808 727.3390 751.9631 786.3998 807.9522 833.3372 859.7218 892.8236 899.8934 913.5672 928.7905 936.9582 972.9225 974.8262 997.2441 1024.2908 1042.5045 1047.9658 1071.9800 1093.6521 1116.1273 1124.3655 1143.4510 1161.7539 1193.3486 1196.8335 1210.3948 1227.1553 1252.2567 1253.2730 1262.8661 1268.5212 1285.4620 1294.3622 1304.8905 1325.9312 1328.7978 1352.4028 1458.6464 1465.7990 1474.7795 1477.4501 2947.0457 2953.2244 3014.2413 3017.9594 3030.4216 3036.8828 3062.7723 3067.7103 3069.3081 3079.2138 3088.5501 3095.0824 3106.6422
redmass: 3.4962 4.0554 5.9664 3.5602 2.6101 4.3663 2.8333 2.3989 2.0562 4.0887 3.3295 5.0977 4.1564 4.4088 3.5269 3.4442 2.9646 3.7606 2.5308 2.4531 2.3237 3.2669 1.7417 3.1882 1.6559 1.8119 2.1882 1.3919 1.5864 2.7280 1.6553 1.0901 1.3132 1.5464 1.2428 1.7992 1.6958 1.2020 1.2061 1.3834 1.3731 1.5351 1.4069 1.3940 1.5056 1.3180 1.5417 1.5074 1.2935 1.0819 1.0835 1.0880 1.0978 1.0671 1.0684 1.0626 1.0848 1.0607 1.0873 1.0946 1.0923 1.0974 1.0928 1.0950 1.0941 1.1061
irintensity: 1.1164 1.9181 2.5136 14.4915 0.3500 8.6551 0.9823 0.7584 0.7118 6.6580 28.7906 7.0708 7.7102 1.6562 0.5636 0.7846 0.6161 19.8661 10.3072 8.0987 8.6165 5.9022 6.6609 23.2513 0.4529 16.7299 7.5072 5.2104 8.6231 22.5444 2.5402 0.6572 2.3485 2.9908 1.7875 0.7897 1.3962 3.8299 12.1213 8.1212 2.1642 5.1188 3.0374 0.6755 13.8720 1.1426 2.9718 2.1057 0.2022 16.8029 4.3248 3.6713 14.3530 63.9204 102.9443 23.5397 26.6469 27.2314 53.0092 2.8907 64.2334 22.9079 7.1674 24.0673 18.3973 11.3423
temp: 298.150 k
press: 1.00000 atm
elementType: 17 8 6 6 6 6 6 6 6 6 6 1 1 1 1 1 1 1 1 1 1 1 1 1
symmnumber: 1
zpe: 535185.9 jmol-1
zpe.correction: 0.203842 hartree
zpe.thermalcorrener: 0.212913 hartree
zpe.thermalcorrenthalpy: 0.213857 hartree
zpe.thermalcorrgfe: 0.169239 hartree
zpe.sumelectzpe: -885.171325 hartree
zpe.sumelectthermal: -885.162254 hartree
zpe.sumelectthermalent: -885.161310 hartree
zpe.sumelectthermalfe: -885.205928 hartree
dipole: 1.3635 1.2502 -2.1892
dipole: 2.8661
quadrupole: -88.2334 -69.1152 -71.5215
quadrupole: 0.5962 -3.7236 1.5395
quadrupole: -11.9434 7.1749 4.7685 0.5962 -3.7236 1.5395
hfenergy: -885.3751666 hartree
pointgroup: C01 [X(C9H13Cl1O1)]
dipole: 0.4754322 0.4951029 -0.8946292 debye
dipolederiv: -0.7326045 -0.1446061 0.1049584 -0.1349588 -0.277743 0.0294023 0.1974762 0.0661044 -0.2506688 -0.6279841 -0.0094343 -0.0861446 -0.0318629 -0.6694572 -0.0118603 -0.0023787 -0.0329564 -0.3726159 -0.0727963 0.0258418 0.0197492 -0.0354032 0.0497411 0.0025952 0.0876316 0.0093439 -0.0215798 0.1186196 -0.0222965 0.0084492 -0.010582 0.0969206 0.0653981 -0.0021477 0.0869624 0.0442634 -0.1145969 0.0025118 0.0020236 0.1934888 -0.0333101 0.0176791 -0.1427588 -0.0118839 0.123586 -0.087397 0.0164998 -0.0296182 -0.0670279 -0.0020913 -0.0563562 -0.0494776 -0.0105268 0.1001974 0.0193331 -0.0128876 -0.0428385 0.0081442 -0.0330893 0.0010256 -0.0255882 0.0045571 -0.0510318 0.8558164 0.2150552 -0.1683191 0.1398198 0.2598737 -0.0378913 -0.2416267 -0.0770576 0.2640003 -0.0728664 -0.0250559 -0.0041556 0.0037977 -0.0782994 -0.0301553 0.0240937 -0.0468177 0.081611 0.3936218 0.0315432 -0.0245592 -0.0340643 0.4275671 0.0916898 0.0308268 0.1787055 0.3314631 0.3680739 0.0119507 -0.059029 0.0677428 0.4703285 -0.045778 -0.0907421 -0.1237656 0.292404 0.0478558 -0.0196576 -0.0017675 -0.0253471 -0.1245067 0.0291925 0.0005906 0.0366079 0.0643459 0.0145741 -0.052385 -0.0238545 -0.0367648 -0.138035 -0.0781895 -0.013562 -0.0912623 0.0387473 0.0173917 -0.0220152 -0.0574138 -0.0205552 0.040032 -0.0539005 -0.031436 -0.0883264 -0.1461917 0.0224872 0.0294001 -0.0169081 0.0140672 -0.0099624 0.0950165 0.0198708 0.1175018 -0.1201642 -0.0019687 0.0208041 -0.1204707 0.0185489 0.0563648 0.0255584 -0.1029 0.0195813 0.0455396 -0.0423236 0.0227145 0.1551173 0.0170929 0.0673551 -0.0150794 0.100203 -0.0080799 -0.0090797 -0.0434295 -0.0391848 0.0389891 -0.0448352 0.0217709 -0.0402654 0.0017703 -0.048084 -0.1106963 -0.0496492 0.0725921 0.0490224 0.0438049 0.0446668 -0.021842 0.075054 -0.0600732 0.0504872 0.0555342 -0.0470381 0.0163003 -0.0235924 0.0060713 0.07654 -0.033802 0.1156491 -0.1191464 0.0747101 -0.0608196 0.0272601 -0.024934 -0.0935683 0.0524027 -0.012936 0.1182259 0.0144327 -0.1046125 0.0542397 0.1000597 0.0323997 -0.0007676 -0.0523502 0.1056725 -0.1554915 -0.1313189 -0.1189965 -0.0449682 0.1038194 -0.0178053 -0.0122777 0.0340962 0.1656741 0.1254118 -0.0920578 0.0812073 -0.0028042 0.00933 -0.0311737 -0.0675838 -0.076928 -0.0595073 -0.1243259 -0.0265266 unknown
polarizability: 118.0946601|4.5192564|92.8751277|-6.0742161|-1.0108725|83.6985697 unknown
InChI: InChI=1S/C9H13ClO/c10-9-2-5-1-6(9)8-4-11-3-7(5)8/h5-9H,1-4H2
charge 0 multiplicity 1
24 atoms
Cl -3.501088 -0.752708 0.316159
O  2.5892 -0.41397 0.578104
C  -0.659744 -0.911651 0.182564
C  -0.247338 1.323931 0.353944
C  0.578787 -0.705983 -0.753473
C  0.88156 0.846936 -0.611504
C  -0.394249 0.113691 1.322158
C  -1.85893 -0.266329 -0.55015
C  -1.597829 1.266957 -0.42646
C  1.876789 -1.396746 -0.26261
C  2.319377 0.904333 -0.034484
H  -0.83134 -1.959445 0.471154
H  -0.050011 2.303385 0.818993
H  0.349738 -1.007334 -1.792026
H  0.828877 1.382979 -1.576243
H  0.521437 -0.102798 1.894404
H  -1.253327 0.209151 2.008113
H  -2.013422 -0.633091 -1.57594
H  -2.406139 1.752804 0.144481
H  -1.542848 1.754017 -1.417191
H  1.700959 -2.28242 0.371004
H  2.512898 -1.686185 -1.126415
H  3.058874 1.101943 -0.839431
H  2.447268 1.651936 0.76685
