program: Gaussian 09
title: 000233455
version: EM64L-G09RevD.01
frameworkgroup: C1[X(C9H13BrO)]
method: RPBEPBE
basis: SDD
operation: Freq
keyword: #p
keyword: freq=noraman
keyword: PBEPBE/SDD
title: #p freq=noraman PBEPBE/SDD
converged: NO YES NO NO
title: Mulliken charges:
elementType: Br O C C C C C C C C C H H H H H H H H H H H H H
charge: -0.052356 -0.234678 -0.171888 -0.195171 -0.167692 -0.125576 -0.506103 -0.504971 -0.453603 -0.374703 -0.381821 0.283137 0.250562 0.239239 0.228342 0.282011 0.242684 0.293278 0.272597 0.217703 0.233554 0.197116 0.197088 0.231250
chargesum: 0.00000
title: Mulliken charges with hydrogens summed into heavy atoms:
elementType: Br O C C C C C C C C C
charge: -0.052356 -0.234678 0.111249 0.055391 0.071546 0.102766 0.018593 -0.211693 0.036697 0.055967 0.046517
polarizability: 1.38432224e+02 4.21895314e+00 9.43754400e+01 -6.96942535e+00 -3.61974174e-01 8.49788230e+01
1716.lowfreq: -29.1575 -12.7234 -0.0002 0.0002 0.0002 9.5095 69.1660 123.6110 143.5540
frequency: 68.8953 123.5434 143.5484 201.4041 217.4497 268.9545 325.9918 384.0568 468.1599 520.8407 584.9295 682.4528 723.1415 750.0828 786.4396 806.4359 831.4411 857.3647 891.4610 898.1874 912.7243 926.9746 933.2667 971.6015 975.0495 994.4981 1023.2683 1040.7770 1046.3594 1071.0016 1093.2494 1115.7667 1121.1930 1140.3030 1156.0089 1189.6103 1195.6784 1203.5331 1222.9535 1247.9249 1252.0474 1260.0628 1267.6892 1285.4847 1291.9002 1304.5801 1325.4035 1327.3021 1351.7556 1457.9064 1466.7801 1474.6326 1477.6226 2947.9428 2953.9601 3013.2511 3018.8957 3031.0720 3037.4435 3063.8031 3068.2773 3070.8379 3079.1069 3088.8215 3096.1562 3105.7966
redmass: 3.5967 4.0099 5.3517 4.2654 5.7395 2.1086 2.6182 2.3686 2.0621 4.5776 2.9628 5.1079 4.1627 4.4132 3.5118 3.4251 2.9413 3.8228 2.6809 2.4322 2.2909 3.2973 1.7107 3.2098 1.6562 1.8536 2.2120 1.4075 1.5978 2.5482 1.7061 1.1017 1.2666 1.6194 1.2103 1.6404 1.6549 1.2498 1.2305 1.4362 1.3405 1.5117 1.3990 1.4055 1.4695 1.3133 1.5070 1.5244 1.2929 1.0812 1.0836 1.0885 1.0979 1.0672 1.0686 1.0629 1.0847 1.0606 1.0872 1.0937 1.0928 1.0978 1.0938 1.0938 1.0936 1.1062
irintensity: 0.9539 1.2263 0.6253 19.0888 1.4140 3.5898 0.2559 0.4872 1.0518 10.0827 26.7030 7.8016 8.3087 1.2701 0.6690 0.8330 1.4051 21.8064 9.7176 9.2356 13.0700 5.7130 4.8418 24.5324 1.1973 14.1516 7.9176 9.1622 7.5126 20.3891 4.9884 2.2830 4.7650 4.0315 3.4443 1.5603 8.1310 13.4914 19.3138 7.1335 2.6293 6.4532 3.3259 0.4424 12.3074 1.6452 5.5384 0.5382 0.2088 16.5143 4.6109 7.7526 9.5091 61.7522 106.9067 22.6042 26.4102 27.0613 52.8431 4.4986 62.4885 20.1708 7.0312 23.5402 12.9998 12.7866
temp: 298.150 k
press: 1.00000 atm
elementType: 35 8 6 6 6 6 6 6 6 6 6 1 1 1 1 1 1 1 1 1 1 1 1 1
symmnumber: 1
zpe: 533744.2 jmol-1
zpe.correction: 0.203292 hartree
zpe.thermalcorrener: 0.212589 hartree
zpe.thermalcorrenthalpy: 0.213533 hartree
zpe.thermalcorrgfe: 0.167579 hartree
zpe.sumelectzpe: -438.570793 hartree
zpe.sumelectthermal: -438.561496 hartree
zpe.sumelectthermalent: -438.560552 hartree
zpe.sumelectthermalfe: -438.606506 hartree
dipole: 1.7255 1.2586 -2.0458
dipole: 2.9575
quadrupole: -89.2541 -72.0718 -74.3819
quadrupole: 2.4903 -5.6218 1.5842
quadrupole: -10.6849 6.4975 4.1874 2.4903 -5.6218 1.5842
hfenergy: -438.7740852 hartree
pointgroup: C01 [X(C9H13Br1O1)]
dipole: 0.5836858 0.5339338 -0.8533194 debye
dipolederiv: -0.7249978 -0.1493245 0.0938815 -0.1478509 -0.2376425 0.0301796 0.2042971 0.0697738 -0.2110346 -0.6467999 -0.0137993 -0.082603 -0.0430377 -0.6672935 -0.0087256 -0.0091851 -0.0329568 -0.3712075 -0.1236669 0.0292929 0.0257767 -0.0808604 0.0543051 -0.0033613 0.1818454 0.0124752 -0.0173688 0.1272084 -0.0183513 0.0089744 -0.0285189 0.0841971 0.0624706 0.0107001 0.0941646 0.0423861 -0.137074 0.0020033 0.0020554 0.2328502 -0.0303883 0.0125139 -0.1995296 -0.0154983 0.125386 -0.08569 0.0183691 -0.0296708 -0.064187 -0.0019114 -0.0575054 -0.0563422 -0.0143926 0.1016978 0.0140532 -0.0181204 -0.0529926 0.0118598 -0.0323218 0.0005873 -0.0195753 0.0091623 -0.0401087 0.9982268 0.2787138 -0.1948758 0.205046 0.2129975 -0.048509 -0.3272643 -0.1084361 0.1965502 -0.0957394 -0.0622399 -0.0023403 0.0055134 -0.0678204 -0.0279297 0.0326799 -0.0277256 0.078911 0.4020783 0.0341041 -0.0255214 -0.0463859 0.4237095 0.0952538 0.066355 0.1802825 0.3274312 0.3765148 0.013683 -0.0592864 0.0772422 0.4702693 -0.0463794 -0.0950291 -0.1222553 0.2933636 0.0502016 -0.0246699 0.0004671 -0.0256329 -0.1221728 0.0292827 -0.0039679 0.0331096 0.0635873 0.0033017 -0.0586785 -0.0253291 -0.0408427 -0.1334373 -0.0774145 -0.0182027 -0.0935277 0.0394694 0.0240198 -0.0200152 -0.0580209 -0.0203092 0.041154 -0.0519942 -0.0335568 -0.0871311 -0.1424975 0.0244125 0.0294975 -0.0169282 0.0122637 -0.0108533 0.0951202 0.022138 0.1174364 -0.1176947 -0.0045343 0.0214743 -0.117401 0.0200232 0.0552687 0.0287538 -0.1061082 0.0188444 0.0458483 -0.0392313 0.0237199 0.1556108 0.0159866 0.065977 -0.017119 0.1039441 -0.0082146 -0.0124156 -0.0815265 -0.0428308 0.0725349 -0.0554966 0.0214747 -0.0228955 0.0130711 -0.0411241 -0.1076067 -0.0450083 0.0709727 0.0514155 0.0459606 0.047136 -0.0240446 0.076284 -0.0613063 0.0507053 0.0413078 -0.055727 0.0139617 -0.0339728 -0.0040227 0.0787213 -0.0347501 0.1153375 -0.1126362 0.0770634 -0.0632391 0.0278821 -0.0272198 -0.09067 0.0514443 -0.0135924 0.1171218 0.0151513 -0.1135691 0.0534109 0.0999965 0.038808 -0.0004516 -0.0541796 0.09964 -0.155265 -0.1296482 -0.1213042 -0.0435609 0.1045694 -0.0161701 -0.010619 0.0321003 0.1696419 0.1234661 -0.0933994 0.0807535 -0.0046846 0.0078435 -0.0350689 -0.0668845 -0.0763698 -0.0634928 -0.1233405 -0.02487 unknown
polarizability: 136.1932443|8.9065228|95.8623758|-9.2110425|-2.0367031|85.7308671 unknown
InChI: InChI=1S/C9H13BrO/c10-9-2-5-1-6(9)8-4-11-3-7(5)8/h5-9H,1-4H2
charge 0 multiplicity 1
24 atoms
Br -3.645332 -0.776056 0.286138
O  2.595194 -0.436868 0.581585
C  -0.661866 -0.90068 0.177576
C  -0.219184 1.327771 0.365506
C  0.583464 -0.705441 -0.754294
C  0.901685 0.843536 -0.605841
C  -0.383244 0.112298 1.324004
C  -1.84589 -0.232101 -0.563128
C  -1.572673 1.298423 -0.411744
C  1.872199 -1.411949 -0.258908
C  2.34198 0.883659 -0.033635
H  -0.845962 -1.948289 0.458004
H  -0.008407 2.3006 0.838657
H  0.355512 -1.002631 -1.794057
H  0.851299 1.38491 -1.567685
H  0.529654 -0.120865 1.894079
H  -1.239364 0.215239 2.012432
H  -1.978858 -0.578498 -1.599275
H  -2.369263 1.788782 0.171318
H  -1.518053 1.799297 -1.395784
H  1.683833 -2.294748 0.375017
H  2.505732 -1.710385 -1.121496
H  3.080887 1.068519 -0.842118
H  2.483157 1.631775 0.764848
