program: Gaussian 09
title: 000233452
version: EM64L-G09RevD.01
frameworkgroup: C1[X(C7H8ClNO)]
method: RPBEPBE
basis: SDD
operation: Freq
keyword: #p
keyword: freq=noraman
keyword: PBEPBE/SDD
title: #p freq=noraman PBEPBE/SDD
converged: NO YES NO NO
title: Mulliken charges:
elementType: Cl O N C C C C C C C H H H H H H H H
charge: -0.047699 -0.173553 0.062275 -0.244487 -0.182644 -0.525290 -0.216273 -0.439724 -0.216131 -0.192973 0.279494 0.267245 0.237761 0.262953 0.315362 0.311636 0.249157 0.252891
chargesum: 0.00000
title: Mulliken charges with hydrogens summed into heavy atoms:
elementType: Cl O N C C C C C C C
charge: -0.047699 -0.173553 0.062275 0.035007 0.084600 -0.024576 0.099089 -0.128088 0.033026 0.059918
polarizability: 1.08183433e+02 -4.18818088e+00 8.43541841e+01 1.76767922e+00 -9.75343186e-01 7.14779492e+01
1716.lowfreq: -22.8635 -16.1096 -0.0012 0.0004 0.0014 10.7445 67.0621 97.8528 175.4817
frequency: 66.8640 97.7694 175.4642 194.3641 266.1338 323.6313 365.0898 447.1677 471.8971 607.0872 663.9096 717.0745 750.8180 754.5059 777.7642 844.0161 870.5015 901.8188 905.1733 922.8940 931.2957 948.6955 975.4164 1013.8350 1049.3730 1087.4555 1104.2754 1139.9537 1159.8614 1174.4443 1205.1126 1223.8098 1250.8760 1260.5149 1264.9058 1273.7492 1318.8501 1416.0735 1475.8329 1575.3600 3026.0472 3044.1778 3072.3096 3103.8893 3105.5064 3111.1184 3171.6239 3206.6913
redmass: 9.9966 6.0878 7.3921 5.6017 5.6646 7.1234 5.0610 2.3395 2.5991 4.3214 4.7349 2.1068 5.1993 3.7316 3.7166 2.9782 3.0295 3.1038 2.3922 1.6052 2.2629 2.2838 1.8028 1.7712 2.0569 1.1697 1.1192 1.4306 1.4875 1.4318 1.4165 1.2233 1.3594 1.4061 1.5781 1.4738 1.7614 7.3762 1.1025 5.7226 1.0606 1.0843 1.0869 1.0887 1.1037 1.0941 1.0890 1.1086
irintensity: 1.2450 3.6845 1.0388 1.5749 6.7026 5.2295 2.8942 2.6698 2.3205 18.2170 9.2876 62.2006 23.2582 17.2648 21.6014 17.7320 18.4697 25.7719 9.1314 6.4410 1.2598 2.0992 1.6602 1.7997 6.5258 2.1812 3.0303 1.5776 7.4351 25.5014 14.3896 9.8320 24.2437 6.6064 9.3594 3.1118 11.1806 109.0336 12.8205 0.3789 25.3105 6.0937 3.7976 30.3325 16.4198 7.1356 4.2562 9.7057
temp: 298.150 k
press: 1.00000 atm
elementType: 17 8 7 6 6 6 6 6 6 6 1 1 1 1 1 1 1 1
symmnumber: 1
zpe: 357773.1 jmol-1
zpe.correction: 0.136269 hartree
zpe.thermalcorrener: 0.144886 hartree
zpe.thermalcorrenthalpy: 0.145830 hartree
zpe.thermalcorrgfe: 0.101950 hartree
zpe.sumelectzpe: -860.714508 hartree
zpe.sumelectthermal: -860.705891 hartree
zpe.sumelectthermalent: -860.704947 hartree
zpe.sumelectthermalfe: -860.748827 hartree
dipole: -0.4389 2.7009 0.1870
dipole: 2.7427
quadrupole: -73.9759 -69.7323 -59.7057
quadrupole: 1.1531 -1.7082 -0.9458
quadrupole: -6.1713 -1.9277 8.0989 1.1531 -1.7082 -0.9458
hfenergy: -860.8507769 hartree
pointgroup: C01 [X(C7H8Cl1N1O1)]
dipole: 0.9408289 -0.5283013 -0.0118736 debye
dipolederiv: -0.2031604 -0.0575462 0.0016129 -0.0591743 -0.6329179 0.1364496 0.0197113 0.2161265 -0.2364522 -0.3693293 -0.039285 0.0533261 -0.6755969 -0.4790071 0.2197772 0.4604554 0.1731654 -0.1928584 0.6738245 0.2533476 -0.2499056 0.6836574 0.2579451 -0.2654298 -0.717696 -0.2763579 -0.041807 -0.0481171 -0.0010066 0.0701918 0.0731128 0.1031423 0.0394147 0.1046619 0.0314915 -0.0362909 0.1119347 -0.0725829 0.137589 -0.1263609 -0.0983519 0.0856245 0.0508371 0.0903156 0.1070261 0.0499417 0.0252556 -0.1110985 -0.0739216 -0.0474192 -0.0294393 -0.0653985 -0.0225597 0.0255758 -0.431604 -0.2757391 0.1137043 -0.2768072 -0.0529499 0.0359405 0.187039 0.0436972 0.0807133 0.1691093 0.0804465 0.0302025 0.2454822 0.9055869 -0.2376434 0.0523401 -0.2705385 0.2099177 -0.008602 0.0675363 -0.1051242 0.0915619 -0.2099124 0.0264007 -0.1282114 0.0802591 0.0358357 -0.1245055 0.0819436 -0.1154431 0.1382511 -0.0247107 0.099105 -0.1187382 0.0651931 -0.0355023 0.0278306 -0.0880066 -0.0350928 -0.0500604 -0.0478043 -0.0563731 -0.028698 -0.03134 0.0627353 0.0013089 -0.0415393 -0.0698557 -0.0153518 0.0349124 -0.079746 -0.0805922 -0.0700399 -0.0329928 -0.0225867 -0.012211 0.1512546 0.0060061 0.0981048 -0.0148725 0.0940712 -0.0029743 -0.0350928 -0.0101062 0.100428 -0.0578662 0.0869777 -0.0602455 0.0593368 -0.0213235 0.0140726 0.069851 0.0484217 0.0290299 -0.0302224 0.0992128 0.0713693 0.0306958 -0.0349865 0.0381462 0.01553 0.0224531 0.0444411 0.0943832 -0.0133293 -0.047554 0.0148867 0.0642786 0.0183375 -0.0255426 0.0969874 -0.0259883 0.0480967 -0.0321901 0.1375127 -0.0620934 0.0786006 -0.0822724 -0.0541761 0.0161993 -0.0685236 0.0742476 -0.1014696 0.0922994 -0.002034 0.0836494 -0.0147221 0.0835301 unknown
polarizability: 96.4769357|11.6369129|94.1242736|-6.9028487|-4.9312524|73.4143567 unknown
InChI: InChI=1S/C7H8ClNO/c8-6-4-1-2-5(3-4)7(6)9-10/h1-2,4-7H,3H2
charge 0 multiplicity 1
18 atoms
Cl 0.39316 2.703284 -0.411433
O  -2.480687 -1.157247 0.658974
N  -2.192984 -0.036576 0.138065
C  0.116192 -1.242283 -0.349435
C  1.33333 0.279245 0.843506
C  0.687564 -1.122807 1.101874
C  -0.764121 0.055109 -0.418562
C  0.032339 1.072932 0.473262
C  1.36658 -0.905961 -1.171608
C  2.097498 0.000722 -0.458738
H  -0.424398 -2.164075 -0.60397
H  1.901429 0.744581 1.660987
H  -0.091325 -1.128168 1.885068
H  1.445123 -1.891107 1.323397
H  -0.905762 0.462705 -1.435307
H  -0.533724 1.383338 1.366093
H  1.562094 -1.270588 -2.182831
H  3.004392 0.522696 -0.768541
