program: Gaussian 09
title: 000233498
version: EM64L-G09RevD.01
frameworkgroup: C1[X(C18H20N2O6)]
method: RPBEPBE
basis: SDD
operation: Freq
keyword: #p
keyword: freq=noraman
keyword: PBEPBE/SDD
title: #p freq=noraman PBEPBE/SDD
converged: YES YES NO NO
title: Mulliken charges:
elementType: O O O O O O N N C C C C C C C C C C C C C C C C C C H H H H H H H H H H H H H H H H H H H H
charge: -0.172946 -0.315198 -0.162671 -0.263027 -0.205038 -0.155210 0.013649 0.004716 -0.149584 0.294842 -0.086084 -0.186413 -0.526212 -0.548444 -0.471769 -0.521673 0.043772 -0.507264 0.417584 -0.790492 -0.546365 0.141893 -0.576991 0.190430 0.335775 -0.136301 0.219835 0.241629 0.221652 0.219711 0.236169 0.233730 0.220746 0.229924 0.211192 0.229968 0.224177 0.251360 0.251462 0.230686 0.231136 0.246267 0.262664 0.258916 0.280652 0.377141
chargesum: 0.00000
title: Mulliken charges with hydrogens summed into heavy atoms:
elementType: O O O O O O N N C C C C C C C C C C C C C C C C C C
charge: -0.172946 0.061943 -0.162671 -0.263027 -0.205038 -0.155210 0.013649 0.004716 0.070251 0.294842 0.155545 0.035239 -0.070331 -0.093967 -0.030653 -0.067529 0.043772 -0.004441 0.417584 -0.082404 -0.024785 0.141893 -0.296338 0.190430 0.335775 -0.136301
polarizability: 3.11851869e+02 -2.65016840e+00 2.65250614e+02 -2.96449809e+00 -1.41904267e+00 1.37271484e+02
1716.lowfreq: -4.2061 -0.0007 -0.0004 0.0009 5.8308 6.5596 24.0158 33.2530 40.6306
frequency: 23.9327 33.2495 40.6303 54.2760 77.8573 88.3539 103.8881 128.1780 136.3661 155.1200 169.6119 184.6238 214.3063 223.8035 232.8431 247.7410 267.0022 280.5710 285.1542 321.6868 322.1461 352.3846 364.7908 386.6585 390.4172 401.5948 421.5880 454.5104 462.6005 474.7078 484.7461 513.2457 529.3066 556.0109 570.7116 581.2546 590.6351 626.3582 649.4655 679.2880 691.8915 702.1956 712.7416 732.6282 733.0256 748.8726 810.7801 818.2161 825.7174 856.4533 859.7186 865.5710 889.1755 903.0636 925.4641 939.0862 945.7835 963.1994 985.6344 998.5488 1008.2924 1013.8984 1031.9368 1059.7337 1068.9306 1078.1461 1088.0226 1100.0214 1118.9710 1130.2047 1132.7747 1157.4801 1169.3522 1181.4210 1197.7324 1201.2212 1204.8497 1212.6797 1228.4002 1241.2889 1243.8718 1255.5304 1258.7639 1266.7144 1287.1273 1292.9296 1295.6522 1302.1379 1314.9571 1320.1647 1325.1022 1334.0634 1345.8904 1353.2449 1357.5014 1369.8504 1376.0106 1384.1659 1386.2112 1418.8198 1428.8022 1436.8118 1459.1148 1469.0961 1471.3404 1473.2292 1479.1565 1486.2746 1490.2101 1580.9405 1600.0624 1657.3474 2763.1115 2903.9625 2913.1428 2963.4456 2979.4840 2982.6200 2986.8597 2991.0372 2991.5161 3001.1981 3007.8782 3038.3280 3043.6976 3048.4584 3054.4597 3058.2877 3073.5375 3082.2361 3084.3895 3179.4298
redmass: 4.1234 7.4525 13.8551 9.2537 4.3263 9.0348 10.0465 5.1093 2.1584 1.9706 5.9368 2.0799 2.1612 4.7832 4.8875 3.9008 2.8391 3.5829 2.9701 8.9494 3.5888 4.3943 2.5156 6.1574 4.8908 4.8941 4.9402 4.8271 4.9278 5.5058 3.0215 3.1152 2.7081 2.6552 3.5004 4.2346 6.0128 5.3266 5.4187 5.0509 3.9389 7.5255 4.5986 7.2310 5.1089 8.2634 2.8078 1.7962 1.8585 2.0623 3.3520 3.7284 1.0666 3.0643 1.9602 1.7245 1.6678 2.3864 2.2797 1.9504 2.1042 2.2522 2.1140 3.0898 2.9942 2.5999 2.2110 6.0363 2.2071 1.7741 1.8772 1.8021 1.9454 3.3982 1.4621 2.9772 2.3485 1.9804 1.5787 1.6535 1.5663 1.9518 1.6645 1.7706 1.3557 1.5419 1.3561 1.9498 1.4323 1.9589 2.0554 1.5503 1.5065 1.7719 2.4540 5.8828 1.7011 1.9102 1.4212 1.4776 1.0799 2.0502 1.0731 1.0896 1.1226 1.1210 2.9924 1.0604 1.0785 3.9165 8.1366 12.0933 1.0677 1.0814 1.0797 1.0795 1.0661 1.0627 1.0414 1.0639 1.0567 1.0597 1.0651 1.0941 1.0987 1.1004 1.1018 1.0991 1.1023 1.0992 1.0994 1.0904
irintensity: 0.0408 1.0400 0.8105 4.0286 1.9587 0.8532 0.4935 0.6079 1.7516 0.2202 4.6624 0.3587 0.1922 0.3457 0.1610 0.4483 0.8737 0.8660 1.2227 1.8330 3.6371 0.4599 0.3584 10.7214 4.4342 5.1261 0.8576 1.2010 0.7586 6.9237 4.2751 1.9241 0.0320 3.9335 3.6664 0.1864 4.4009 4.0985 10.2128 12.9122 2.5402 2.2197 6.0450 27.8697 18.3075 3.5940 2.8229 10.3416 4.2810 9.6205 7.8264 10.4545 127.3675 12.3113 14.6174 19.3324 7.3484 12.6305 9.3824 9.0334 8.1905 18.3520 14.6187 25.3962 4.8627 6.1663 10.3900 232.1371 14.7200 8.1834 9.9505 23.3645 14.9770 87.4780 12.8634 108.9976 82.0055 71.5328 11.8452 13.7056 20.8553 33.8569 22.0423 23.9880 6.5427 1.2982 3.7305 13.2049 7.6349 38.8325 50.8039 2.2912 0.1921 14.3472 1.2900 67.0153 5.1085 40.1066 8.9992 153.7633 22.0777 176.3349 7.1508 9.2715 6.0875 5.9521 77.0901 8.6447 10.3660 111.9106 58.0990 195.1076 240.4624 10.8545 15.1966 6.8423 34.9148 30.8478 9.6561 7.9908 39.1746 24.9060 14.3661 12.9786 22.7489 28.8157 39.6002 9.5888 36.9686 18.8153 27.3383 1.6648
temp: 298.150 k
press: 1.00000 atm
elementType: 8 8 8 8 8 8 7 7 6 6 6 6 6 6 6 6 6 6 6 6 6 6 6 6 6 6 1 1 1 1 1 1 1 1 1 1 1 1 1 1 1 1 1 1 1 1
symmnumber: 1
zpe: 940760.8 jmol-1
zpe.correction: 0.358317 hartree
zpe.thermalcorrener: 0.380815 hartree
zpe.thermalcorrenthalpy: 0.381759 hartree
zpe.thermalcorrgfe: 0.306267 hartree
zpe.sumelectzpe: -1256.682879 hartree
zpe.sumelectthermal: -1256.660381 hartree
zpe.sumelectthermalent: -1256.659437 hartree
zpe.sumelectthermalfe: -1256.734929 hartree
dipole: 4.6971 -4.2756 -0.6467
dipole: 6.3845
quadrupole: -200.0213 -175.0069 -146.6974
quadrupole: -6.9418 0.7763 2.7260
quadrupole: -26.1128 -1.0984 27.2111 -6.9418 0.7763 2.7260
hfenergy: -1257.041196 hartree
pointgroup: C01 [X(C18H20N2O6)]
dipole: -1.8564484 1.6838554 -0.166305 debye
polarizability: 311.8735458|-2.5717538|264.708696|2.9518298|8.2332036|137.7917253 unknown
InChI: InChI=1S/C18H20N2O6/c1-18-7-6-9-10(13(18)4-5-15(18)21)2-3-11-12(9)8-14(19(23)24)17(22)16(11)20(25)26/h8-10,13,22H,2-7H2,1H3
charge 0 multiplicity 1
46 atoms
O  -6.017378 -1.522864 -0.162733
O  4.871612 -0.027307 0.236145
O  2.631003 3.401229 0.798426
O  4.641223 2.422824 0.461385
O  3.007739 -3.666277 0.101174
O  4.830051 -2.563801 -0.71932
N  3.312211 2.36465 0.474576
N  3.633701 -2.586787 -0.253107
C  -3.142968 0.587344 -0.401267
C  -3.730896 -0.652113 0.3404
C  -1.668578 0.821741 -0.036585
C  -0.862641 -0.440667 -0.466737
C  -2.958288 -1.917002 -0.085494
C  -4.209013 1.696229 -0.196837
C  -1.434394 -1.745193 0.171267
C  -1.030889 2.050619 -0.705105
C  -5.212531 -0.565924 -0.078372
C  -5.544859 0.915696 -0.376452
C  0.647652 -0.252931 -0.244342
C  -3.746784 -0.511566 1.896992
C  0.382716 2.29152 -0.142866
C  1.241674 1.031424 -0.069373
C  1.483708 -1.394704 -0.261199
C  2.665024 1.096919 0.141709
C  2.876289 -1.317207 -0.143363
C  3.526342 -0.069113 0.064995
H  -3.163875 0.334287 -1.488193
H  -1.579117 0.951276 1.063298
H  -1.016029 -0.537582 -1.566998
H  -3.131318 -2.10425 -1.164339
H  -3.331762 -2.806735 0.453784
H  -4.110091 2.520687 -0.923804
H  -4.13773 2.138489 0.814324
H  -1.223211 -1.745106 1.258282
H  -0.925555 -2.634317 -0.24386
H  -1.636852 2.957379 -0.523328
H  -0.994224 1.900387 -1.803302
H  -5.917614 0.97711 -1.417154
H  -6.369763 1.263283 0.271116
H  -2.727191 -0.4790 2.317017
H  -4.275977 0.39744 2.234149
H  -4.266042 -1.383746 2.332822
H  0.308033 2.729493 0.871135
H  0.903676 3.065527 -0.734751
H  1.060616 -2.393853 -0.389037
H  5.130401 0.972195 0.339223
