program: Gaussian 09
title: 000233415
version: EM64L-G09RevD.01
frameworkgroup: C1[X(C16H15NO3)]
method: RPBEPBE
basis: SDD
operation: Freq
keyword: #p
keyword: freq=noraman
keyword: PBEPBE/SDD
title: #p freq=noraman PBEPBE/SDD
converged: NO YES NO NO
title: Mulliken charges:
elementType: O O O N C C C C C C C C C C C C C C C C H H H H H H H H H H H H H H H
charge: -0.181213 -0.200342 -0.198327 0.027834 0.071050 0.342792 0.342794 0.482965 -0.618160 -0.618055 -0.040639 0.320722 -0.840248 -0.840115 -0.813851 -0.316815 -0.337895 -0.369773 -0.362621 0.378315 0.242113 0.242100 0.234759 0.234196 0.256043 0.256213 0.234726 0.233989 0.236067 0.227491 0.227481 0.275517 0.289294 0.290098 0.291494
chargesum: 0.00000
title: Mulliken charges with hydrogens summed into heavy atoms:
elementType: O O O N C C C C C C C C C C C C C C C C
charge: -0.181213 -0.200342 -0.198327 0.027834 0.071050 0.342792 0.342794 0.482965 -0.376048 -0.375955 -0.040639 0.320722 -0.115250 -0.115187 -0.122811 -0.041299 -0.048601 -0.079675 -0.071126 0.378315
polarizability: 2.71299718e+02 -1.41940175e+01 1.76480823e+02 -1.49393124e-01 9.66459307e-02 1.43578995e+02
1716.lowfreq: -30.5696 -12.9219 -4.0904 0.0003 0.0005 0.0006 5.9657 29.3998 37.3147
frequency: -30.3319 29.2474 37.2363 43.4522 57.9485 60.9013 65.0746 69.6546 106.2563 133.4459 170.0594 186.2386 222.5463 244.4824 245.0467 268.9296 275.1906 301.3045 341.6442 407.3589 441.0836 451.3493 481.1451 493.1788 511.4737 518.6249 524.1451 553.7186 565.9404 617.6178 623.8133 658.7780 697.5095 699.2447 752.4714 774.3882 787.7414 863.9755 865.4932 889.1214 896.6030 897.7532 937.0166 954.9577 1002.6498 1004.9065 1016.0039 1017.6305 1018.3799 1042.1146 1043.0323 1044.2806 1050.6206 1088.5226 1106.0292 1119.8247 1173.0508 1185.7875 1215.1450 1254.9593 1259.1101 1291.4732 1317.2341 1357.0232 1366.2096 1398.6649 1398.8565 1400.7622 1404.4199 1409.5404 1414.0864 1442.6427 1467.3159 1468.3827 1469.8031 1473.6511 1474.8371 1480.6288 1492.5567 1558.5921 1579.3045 1596.8478 1607.0283 1618.3032 2976.2957 2976.8122 2977.6569 3054.1530 3054.2943 3059.4044 3088.6438 3090.0101 3090.3673 3117.1680 3121.2624 3153.4172 3160.2517 3185.3267 3187.7917
redmass: 4.6461 5.4943 4.3908 1.0160 1.6372 1.0874 2.3581 5.0837 3.6962 5.6635 4.8734 3.7625 2.8911 4.1458 6.5363 2.5470 7.8184 4.1761 5.4594 2.8887 3.7060 5.6188 2.9692 9.0269 3.1435 5.0828 5.7165 4.4948 4.1628 4.0486 5.9194 5.5962 7.9083 3.8222 4.0598 4.9194 9.0807 1.3224 1.2600 1.6750 1.3136 4.9863 2.3084 3.6962 1.3498 2.9903 1.6868 1.3623 1.5545 1.8231 1.5465 1.5192 1.6154 3.4783 1.2920 4.1198 1.2568 1.7024 6.6139 1.4267 3.7715 1.2811 6.4343 7.2972 7.4593 1.3446 1.2232 1.2477 8.6817 4.4589 2.2989 2.0349 1.2091 1.0460 1.8098 1.0868 1.0553 1.1634 1.4541 10.4287 7.0851 7.7696 6.8749 5.9269 1.0383 1.0384 1.0388 1.0965 1.0965 1.0948 1.0999 1.0988 1.0987 1.0910 1.0920 1.0904 1.0901 1.0947 1.0961
irintensity: 0.4049 0.0038 0.0382 0.3948 1.7051 1.2990 0.6483 3.8687 0.7617 0.2872 5.6653 2.2385 0.0071 5.8473 1.2115 0.1998 2.3949 0.3807 0.0532 0.0172 0.4703 7.0692 3.5236 5.0423 0.0056 0.0157 4.9373 4.0657 0.1835 3.9157 2.0664 5.7890 5.3000 32.7746 10.7926 3.4753 51.5812 30.0374 1.3274 45.3668 0.0602 74.3383 3.2670 8.6723 1.8424 6.6401 9.3271 0.0215 1.7208 0.1670 4.0743 0.0451 24.0803 13.9966 12.6586 12.6197 2.8907 83.1071 348.0530 0.0641 135.5464 1.2278 8.8867 0.1280 80.2294 22.4626 19.2508 0.6926 5.2330 73.4450 1.2474 40.4988 30.0449 0.0173 4.9312 6.9732 13.8712 31.8234 8.7092 97.7254 15.0303 5.5635 9.1639 49.6388 31.5988 33.3917 16.9388 1.1239 31.3238 22.6435 12.0590 20.6357 23.4433 23.4246 13.3426 1.8027 2.1290 0.5223 0.8898
temp: 298.150 k
press: 1.00000 atm
elementType: 8 8 8 7 6 6 6 6 6 6 6 6 6 6 6 6 6 6 6 6 1 1 1 1 1 1 1 1 1 1 1 1 1 1 1
symmnumber: 1
zpe: 706671.4 jmol-1
zpe.correction: 0.269157 hartree
zpe.thermalcorrener: 0.287807 hartree
zpe.thermalcorrenthalpy: 0.288751 hartree
zpe.thermalcorrgfe: 0.220026 hartree
zpe.sumelectzpe: -897.632572 hartree
zpe.sumelectthermal: -897.613922 hartree
zpe.sumelectthermalent: -897.612978 hartree
zpe.sumelectthermalfe: -897.681703 hartree
dipole: 4.4720 -1.1404 -0.0064
dipole: 4.6151
quadrupole: -137.3760 -124.3444 -108.8897
quadrupole: -18.0954 -0.1331 -0.1169
quadrupole: -13.8393 -0.8077 14.6470 -18.0954 -0.1331 -0.1169
hfenergy: -897.9017291 hartree
pointgroup: C01 [X(C16H15N1O3)]
dipole: 1.7567107 -0.4591608 -0.0003402 debye
polarizability: 271.1267319|-14.7599303|176.6534207|-0.1225863|-0.1286408|143.5793839 unknown
InChI: InChI=1S/C16H15NO3/c1-10-8-11(2)15(12(3)9-10)16(18)13-4-6-14(7-5-13)17(19)20/h4-9H,1-3H3
charge 0 multiplicity 1
35 atoms
O  0.654949 2.707413 -0.003092
O  -4.813179 -2.243227 0.00376
O  -5.745103 -0.161623 0.003046
N  -4.727771 -0.955413 0.002915
C  1.774107 0.554738 -0.001167
C  2.355876 0.162041 1.237631
C  2.358989 0.165056 -1.239452
C  4.117453 -1.057628 -0.000179
C  3.520825 -0.640953 1.214742
C  3.523812 -0.638078 -1.215581
C  0.550508 1.445385 -0.00174
C  -0.813133 0.797832 -0.000406
C  1.755779 0.61054 2.56044
C  1.762081 0.616642 -2.562649
C  5.351834 -1.942266 0.000279
C  -0.961501 -0.614657 0.00051
C  -1.967603 1.627921 -0.000236
C  -2.243599 -1.197802 0.001592
C  -3.254024 1.062903 0.000848
C  -3.368921 -0.34624 0.001756
H  3.974655 -0.941513 2.167426
H  3.979947 -0.936452 -2.167851
H  2.330777 0.211028 3.412223
H  0.708358 0.270748 2.674319
H  1.748103 1.713061 2.642134
H  1.75435 1.71935 -2.641614
H  2.339273 0.219318 -3.413972
H  0.715017 0.276891 -2.679943
H  5.072844 -3.013952 -0.001836
H  5.97707 -1.764857 -0.89205
H  5.974403 -1.767677 0.895021
H  -0.069485 -1.249442 0.000301
H  -1.823977 2.71307 -0.000982
H  -2.388911 -2.280945 0.002294
H  -4.158805 1.675888 0.001012
