program: Gaussian 09
title: 000233436
version: EM64L-G09RevD.01
frameworkgroup: C1[X(C22H21N)]
method: RPBEPBE
basis: SDD
operation: Freq
keyword: #pfreq=noraman
keyword: PBEPBE/SDD
title: #p freq=noraman PBEPBE/SDD
converged: YES YES NO NO
title: Mulliken charges:
elementType: N C C C C C C C C C C C C C C C C C C C C C C H H H H H H H H H H H H H H H H H H H H H
charge: -0.111562 0.076096 0.281310 0.241614 -0.673673 0.163124 0.179832 -0.463493 -0.430187 0.518681 -0.656915 -0.641770 -0.404149 -0.416240 -0.244257 -0.263614 -0.234118 -0.231022 -0.396869 -0.400660 -0.239570 -0.240180 -0.245781 0.218701 0.233714 0.269896 0.247456 0.200578 0.225790 0.244591 0.256906 0.212906 0.207548 0.238400 0.239549 0.224747 0.225294 0.222972 0.224734 0.242076 0.230198 0.221574 0.221611 0.224160
chargesum: 0.00000
title: Mulliken charges with hydrogens summed into heavy atoms:
elementType: N C C C C C C C C C C C C C C C C C C C C C C
charge: -0.111562 0.076096 0.281310 0.241614 -0.221258 0.163124 0.179832 -0.193596 -0.182731 0.518681 0.014044 0.035589 -0.165749 -0.176691 -0.019510 -0.038320 -0.011146 -0.006289 -0.154793 -0.170462 -0.017996 -0.018569 -0.021621
polarizability: 2.14422179e+02 -3.77088369e+01 2.66931047e+02 -2.04306341e+01 -1.35561096e+01 2.15469845e+02
1716.lowfreq: -10.6587 -8.3988 -2.4212 -0.0008 -0.0006 0.0003 25.1471 38.8556 58.3029
frequency: 25.0366 38.8505 58.2767 61.5475 85.4662 105.3316 109.3291 153.4721 166.0619 173.9250 219.9331 231.3952 239.3407 246.4056 291.4400 318.1941 343.3157 354.9417 376.5440 404.1614 409.8783 417.2280 436.2974 482.8072 491.1687 508.2330 535.0711 570.9613 580.8092 611.4929 614.8424 618.7845 625.5319 689.8279 702.1372 741.8644 747.7850 752.4554 759.3422 775.2282 794.5682 806.9054 817.7463 848.4178 873.5537 885.9913 893.1909 919.7360 945.0907 953.1404 970.8985 979.3106 983.1313 987.6682 990.4810 992.3793 996.0252 1007.2907 1021.8307 1025.5143 1029.5759 1033.8161 1038.6117 1082.7204 1084.6633 1102.5602 1104.7510 1138.8247 1146.2646 1166.4643 1170.8224 1173.5663 1178.4180 1191.0531 1208.9134 1219.5383 1222.4881 1235.7692 1248.9010 1287.7189 1300.5360 1312.3769 1331.2638 1374.8419 1383.7282 1403.8081 1416.7541 1435.3705 1440.0429 1441.0844 1442.4102 1461.2445 1464.2671 1471.0926 1474.8336 1482.0731 1483.3280 1486.1699 1495.2647 1589.8274 1592.6248 1595.6640 1612.2139 1615.1089 1618.9239 2879.6486 2897.9085 2991.4801 3023.7391 3027.8765 3053.6971 3094.6819 3097.4641 3118.0960 3120.1646 3121.0195 3123.6212 3128.4082 3130.3069 3135.8208 3140.9013 3142.1554 3144.9912 3158.8102 3159.6847 3161.0531
redmass: 4.3125 4.9895 3.8172 2.9823 3.4599 3.7115 4.1926 4.3447 3.5929 3.8904 3.8329 2.2281 1.3005 1.3536 3.3331 3.5426 3.2095 2.1294 3.3159 2.8121 5.2937 2.9689 3.4913 3.0110 3.1135 5.3380 3.5083 3.3522 5.1677 3.6636 6.4720 6.0280 5.4019 5.4973 1.7132 3.2966 3.7091 1.5366 1.4249 2.4325 2.2156 4.2896 3.1838 1.2486 1.5162 1.6874 2.0433 1.6792 1.4583 1.4479 1.4110 2.2686 1.3305 1.3399 1.8814 2.5871 6.2076 4.0882 2.3080 2.3097 2.0043 1.8886 2.3171 1.2906 1.6308 2.0603 1.7673 1.4856 1.5353 1.2451 1.0556 1.0961 2.0986 1.1395 2.6935 2.1371 1.8867 1.9312 2.2948 1.5206 1.8394 1.6585 1.2616 9.3551 7.4367 3.6861 1.1408 2.0471 1.8988 2.3515 1.4214 1.0612 2.4753 1.1230 1.0673 1.9621 1.7524 1.7055 1.0582 6.6754 6.0066 7.0728 7.1160 6.1447 7.2112 1.0554 1.0535 1.0583 1.0770 1.0792 1.1026 1.0971 1.0969 1.0841 1.0849 1.0848 1.0872 1.0892 1.0894 1.0921 1.0945 1.0947 1.0964 1.1003 1.1002 1.1016
irintensity: 0.0116 0.0415 0.1487 0.6820 0.0696 0.2322 1.5865 0.6119 0.2478 0.8273 0.5078 0.8922 0.3255 0.4956 3.1632 0.1603 5.1453 0.1362 4.3796 0.0134 0.5150 6.4449 1.5449 2.2842 1.5451 0.2815 3.0632 0.1102 7.5072 26.4514 3.9357 0.6743 5.6107 0.7107 59.4113 45.5449 14.7849 22.5090 69.7289 40.6628 2.1611 2.2518 2.5130 1.4522 2.0654 0.2161 4.5351 7.2931 7.1413 5.2572 1.3527 4.6437 0.0069 0.2958 0.2630 0.7088 2.5751 25.9671 8.4621 5.0747 14.4857 11.5290 25.4243 4.6214 8.1885 5.4417 3.1825 1.6082 1.2702 0.9752 0.0528 0.2653 4.4053 1.6418 11.1326 3.4318 0.7398 2.0244 0.3370 4.9675 2.0080 6.0967 0.4027 8.7783 0.4862 0.5251 3.3944 19.0602 18.2572 3.7972 11.1059 16.5764 6.6788 14.4897 5.9939 1.7428 6.3659 21.4874 6.6687 0.5605 1.4110 0.6442 3.1036 6.6648 0.8346 68.8986 106.2165 27.8666 60.3961 41.5790 11.9023 23.9430 28.4825 2.7410 1.5408 1.1422 0.1980 8.3770 1.5230 23.2567 6.1060 47.7606 37.6195 64.2686 10.7525 20.4314
temp: 298.150 k
press: 1.00000 atm
elementType: 7 6 6 6 6 6 6 6 6 6 6 6 6 6 6 6 6 6 6 6 6 6 6 1 1 1 1 1 1 1 1 1 1 1 1 1 1 1 1 1 1 1 1 1
symmnumber: 1
zpe: 953480.0 jmol-1
zpe.correction: 0.363161 hartree
zpe.thermalcorrener: 0.382605 hartree
zpe.thermalcorrenthalpy: 0.383549 hartree
zpe.thermalcorrgfe: 0.315295 hartree
zpe.sumelectzpe: -904.077542 hartree
zpe.sumelectthermal: -904.058098 hartree
zpe.sumelectthermalent: -904.057154 hartree
zpe.sumelectthermalfe: -904.125408 hartree
dipole: 0.7261 -0.2867 0.0522
dipole: 0.7824
quadrupole: -133.1519 -125.4122 -127.1639
quadrupole: -6.2557 -5.2135 -1.0588
quadrupole: -4.5759 3.1638 1.4121 -6.2557 -5.2135 -1.0588
hfenergy: -904.440703 hartree
pointgroup: C01 [X(C22H21N1)]
dipole: -0.2423864 0.1880629 0.0250801 debye
polarizability: 194.7211324|-20.1105457|281.0288024|19.6966167|13.2468696|221.0731361 unknown
InChI: InChI=1S/C22H21N/c1-23(2)22(16-17-10-4-3-5-11-17)20-14-8-6-12-18(20)19-13-7-9-15-21(19)22/h3-15H,16H2,1-2H3
charge 0 multiplicity 1
44 atoms
N  -2.01639 0.009514 -1.94254
C  -0.838427 0.130614 -1.011136
C  -0.707219 -1.166145 -0.191456
C  -0.98128 1.184067 0.118217
C  0.46236 0.385922 -1.862482
C  -0.720047 -0.894143 1.204171
C  -0.903356 0.559034 1.398242
C  -0.595207 -2.481053 -0.667579
C  -1.147151 2.577606 0.023613
C  1.781321 0.267552 -1.109335
C  -2.209861 1.087826 -2.935995
C  -3.295104 -0.288147 -1.253776
C  -0.594472 -1.944245 2.13911
C  -1.001745 1.319948 2.582056
C  -0.473598 -3.539146 0.268443
C  -1.258104 3.345162 1.212493
C  -0.466803 -3.269897 1.66039
C  -1.185133 2.719934 2.481073
C  2.311721 1.367715 -0.386589
C  2.52782 -0.938435 -1.140351
C  3.545287 1.262719 0.294103
C  3.763013 -1.048275 -0.463901
C  4.276827 0.053184 0.258713
H  0.394821 1.399654 -2.299147
H  0.434645 -0.339746 -2.697469
H  -0.624492 -2.683252 -1.743955
H  -1.181207 3.079907 -0.94923
H  -2.536755 2.059858 -2.493096
H  -2.999135 0.767816 -3.641091
H  -1.2946 1.257402 -3.524239
H  -3.170748 -1.148998 -0.577755
H  -4.053193 -0.553933 -2.013026
H  -3.687571 0.570751 -0.659072
H  -0.599555 -1.745351 3.216798
H  -0.932598 0.842951 3.566364
H  -0.386948 -4.573258 -0.084055
H  -1.395019 4.430709 1.148915
H  -0.369064 -4.098374 2.371261
H  -1.265708 3.32641 3.390321
H  1.752596 2.310002 -0.353034
H  2.13723 -1.797337 -1.698721
H  3.936275 2.124041 0.847924
H  4.323456 -1.989421 -0.502205
H  5.23572 -0.028442 0.78323
