program: Gaussian 09
title: 000022159
version: EM64L-G09RevD.01
frameworkgroup: C1[X(C13H16N2O3)]
method: RPBEPBE
basis: SDD
operation: Freq
keyword: #p
keyword: freq=noraman
keyword: PBEPBE/SDD
title: #p freq=noraman PBEPBE/SDD
converged: YES YES NO NO
title: Mulliken charges:
elementType: O O O N N C C C C C C C C C C C C C H H H H H H H H H H H H H H H H
charge: -0.272478 -0.166991 -0.199644 -0.070509 -0.095421 -0.324907 0.226802 0.445414 0.236108 0.143578 -0.324170 -0.398068 -0.277379 -0.335013 -0.218977 -0.773038 -0.802792 -0.675123 0.263099 0.235695 0.236935 0.287212 0.250037 0.226874 0.236929 0.247388 0.270881 0.253767 0.226969 0.236664 0.236613 0.212366 0.234056 0.227121
chargesum: 0.00000
title: Mulliken charges with hydrogens summed into heavy atoms:
elementType: O O O N N C C C C C C C C C C C C C
charge: -0.272478 -0.166991 -0.199644 -0.070509 -0.095421 -0.061807 0.226802 0.445414 0.236108 0.143578 -0.088475 -0.161133 0.009833 -0.084975 0.244827 -0.001003 -0.102547 -0.001580
polarizability: 3.03221833e+02 -1.80886029e+01 1.40437427e+02 -9.70081801e+00 -2.04120367e+01 1.23561136e+02
1716.lowfreq: -3.2732 -0.0002 0.0005 0.0007 3.0364 5.2239 24.0312 26.0485 40.6991
frequency: 23.8586 25.8583 40.6860 50.8586 55.0081 62.1503 69.6132 83.0158 91.3431 131.8011 166.0492 173.7662 192.9715 219.0438 244.5254 256.5186 272.8065 322.3685 332.0749 354.2203 371.3076 415.2723 416.2884 458.8264 506.3251 517.2603 555.3094 619.1641 626.9010 645.7311 721.5007 733.0591 765.8362 800.9000 817.8367 823.2966 839.8332 851.9688 856.4497 936.4134 960.6853 972.5308 985.0729 992.6451 998.0519 1006.0685 1022.5008 1040.2765 1046.4927 1107.1949 1115.6376 1117.5995 1136.6599 1149.3601 1162.9464 1207.1935 1212.5268 1222.0506 1251.7789 1298.7161 1302.7752 1359.2022 1371.0504 1375.3495 1385.1158 1398.2812 1401.3917 1419.9159 1445.8301 1451.7641 1463.9342 1467.8534 1473.4316 1474.7151 1486.5871 1488.1912 1578.9131 1614.4650 1647.7654 1666.8864 2978.2086 2978.8070 2995.8368 3005.9191 3011.9759 3055.7102 3062.0801 3071.3902 3089.4557 3092.2678 3108.4505 3123.7909 3126.8302 3132.8125 3160.2822 3165.9736
redmass: 4.4838 3.8083 4.4849 1.0885 4.3475 3.5087 4.1600 3.6315 3.8691 3.9609 1.9062 1.4456 3.8031 3.8745 3.9844 1.6085 6.2374 3.1017 4.0958 3.5374 4.4757 3.1039 4.3435 6.0154 4.8208 2.9630 3.7842 5.4319 5.6199 4.7078 3.1531 6.1260 4.9674 1.1103 3.8759 3.6438 1.8252 2.2536 1.6102 3.2866 3.4150 1.3664 1.5162 2.4890 1.3505 2.6524 2.0933 2.6354 1.5783 2.8740 1.4384 1.9416 1.4675 1.9105 1.9187 1.7338 1.5368 3.2957 1.1330 1.4656 1.4905 1.3944 1.7368 2.2934 6.7816 1.3061 1.2676 3.7645 1.0511 1.0678 1.0401 1.0456 1.1434 1.0621 1.0679 2.4757 6.1719 6.3735 8.3637 11.6960 1.0375 1.0374 1.0359 1.0822 1.0584 1.0971 1.0955 1.1065 1.0989 1.0985 1.1028 1.1007 1.0896 1.0886 1.0959 1.0953
irintensity: 1.0806 1.1404 0.7562 0.5584 3.3606 1.9997 2.5186 0.9055 3.3502 2.0753 1.1156 0.2674 0.1881 1.3163 5.9988 0.7488 2.5771 2.2784 3.0041 8.1123 9.0241 2.3129 6.4107 0.2676 26.1468 16.1040 5.0943 14.9753 0.7113 1.1909 3.0757 14.5332 2.4954 6.0234 1.9781 15.4512 55.0909 17.0312 12.5852 13.5905 32.8551 2.4135 16.7376 30.5448 1.4054 7.7782 34.3437 71.0556 15.0458 342.0467 30.6399 144.6201 4.4251 137.6644 30.9317 21.9399 117.2591 2.1078 0.1153 22.7546 50.3359 1.5998 49.8119 30.3922 33.5536 10.6367 22.3605 4.9211 14.6756 19.0471 12.1949 13.7862 13.0506 5.0540 12.9209 12.9992 5.7940 69.1589 213.6445 156.0961 28.3269 3.7260 22.9475 16.3171 19.2295 16.8311 4.0565 5.5195 20.6017 30.7960 41.2895 7.7320 16.7165 17.5705 12.3558 4.9197
temp: 298.150 k
press: 1.00000 atm
elementType: 8 8 8 7 7 6 6 6 6 6 6 6 6 6 6 6 6 6 1 1 1 1 1 1 1 1 1 1 1 1 1 1 1 1
symmnumber: 1
zpe: 699140.8 jmol-1
zpe.correction: 0.266289 hartree
zpe.thermalcorrener: 0.285739 hartree
zpe.thermalcorrenthalpy: 0.286683 hartree
zpe.thermalcorrgfe: 0.215229 hartree
zpe.sumelectzpe: -838.768986 hartree
zpe.sumelectthermal: -838.749536 hartree
zpe.sumelectthermalent: -838.748592 hartree
zpe.sumelectthermalfe: -838.820046 hartree
dipole: 2.2372 1.3344 -2.8308
dipole: 3.8469
quadrupole: -72.4577 -103.1844 -109.9913
quadrupole: 0.3055 8.5005 -3.6199
quadrupole: 22.7535 -7.9733 -14.7802 0.3055 8.5005 -3.6199
hfenergy: -839.0352752 hartree
pointgroup: C01 [X(C13H16N2O3)]
dipole: 0.8685701 0.611955 -1.0778637 debye
polarizability: 304.9236944|-8.6913555|140.5050911|-5.9832253|-20.4132413|121.7916109 unknown
InChI: InChI=1S/C13H16N2O3/c1-4-18-13(17)12(10(3)16)15-14-11-7-5-9(2)6-8-11/h5-8,12H,4H2,1-3H3
charge 0 multiplicity 1
34 atoms
O  -3.797606 -0.646678 -0.543814
O  -2.637057 1.173273 1.835313
O  -2.297666 -2.078719 0.53045
N  -0.215956 -0.183093 0.133357
N  0.646339 0.511873 -0.549682
C  -1.621686 0.21019 -0.194551
C  -2.031774 1.388432 0.761792
C  4.804961 -0.256115 0.108186
C  -2.553918 -0.985863 -0.006258
C  2.021412 0.201675 -0.27278
C  3.832292 -0.998789 0.840568
C  4.352431 0.717878 -0.818286
C  2.457573 -0.781103 0.660895
C  2.974097 0.94695 -1.010332
C  -4.885221 -1.659215 -0.365054
C  -1.609564 2.762056 0.281578
C  6.28486 -0.509547 0.322044
C  -6.158791 -1.042628 -0.932911
H  -1.696194 0.594228 -1.230584
H  4.170354 -1.755827 1.558783
H  5.084407 1.297832 -1.391795
H  1.706988 -1.349478 1.21919
H  2.613588 1.693926 -1.725534
H  -4.586916 -2.582587 -0.893979
H  -4.965625 -1.887149 0.712819
H  -2.297537 3.088768 -0.522916
H  -0.595535 2.727419 -0.157048
H  -1.65516 3.489159 1.106785
H  6.906107 0.134696 -0.322673
H  6.574887 -0.318877 1.372651
H  6.545823 -1.562102 0.102989
H  -6.998419 -1.752952 -0.82257
H  -6.417275 -0.1135 -0.397152
H  -6.041516 -0.807834 -2.004781
