program: Gaussian 09
title: 000233434
version: EM64L-G09RevD.01
frameworkgroup: C1[X(C22H20O)]
method: RPBEPBE
basis: SDD
operation: Freq
keyword: #pfreq=noraman
keyword: PBEPBE/SDD
title: #p freq=noraman PBEPBE/SDD
converged: YES YES NO NO
title: Mulliken charges:
elementType: O C C C C C C C C C C C C C C C C C C C C C C H H H H H H H H H H H H H H H H H H H H
charge: -0.226166 -0.263978 -0.380262 0.554314 0.518575 -0.747722 0.095105 0.306521 -0.441689 -0.408295 -0.425482 -0.399858 -0.228309 -0.233269 -0.224288 -0.249160 -0.351037 -0.357230 -0.245211 -0.246912 -0.252869 -0.233651 -0.226163 0.250083 0.230373 0.201391 0.247430 0.231914 0.223439 0.268364 0.230912 0.224202 0.223847 0.224500 0.222832 0.220955 0.239845 0.276840 0.227165 0.225653 0.230664 0.233170 0.233461
chargesum: 0.00000
title: Mulliken charges with hydrogens summed into heavy atoms:
elementType: O C C C C C C C C C C C C C C C C C C C C C C
charge: -0.226166 -0.013896 -0.149889 0.554314 0.518575 -0.066988 0.095105 0.306521 -0.210778 -0.184093 -0.202043 -0.131494 -0.004462 -0.008769 -0.001456 -0.028206 -0.111192 -0.080390 -0.018046 -0.021259 -0.022205 -0.000481 0.007298
polarizability: 2.79625675e+02 -2.85345797e+01 1.89624235e+02 -2.53953418e+00 5.56793365e-02 2.17996873e+02
1716.lowfreq: -8.0897 -0.0008 -0.0003 -0.0003 2.2047 3.5660 20.7203 28.5058 33.0881
frequency: 20.6300 28.3806 33.0538 34.1475 49.2112 54.8966 85.6771 123.8453 151.0427 155.6638 192.6777 211.4297 222.5443 226.6587 251.4320 274.4017 330.0540 358.5729 399.6801 402.9036 404.6610 416.9672 447.0116 479.9994 514.8909 549.3422 560.1432 588.2276 612.8858 614.9246 617.5582 656.7637 689.6140 698.1151 704.8208 707.7534 746.4900 766.6616 773.1375 782.9233 834.9138 846.9191 850.9915 854.6976 857.9187 901.7999 918.5709 929.5812 942.9355 974.0122 979.5611 987.1742 988.3268 990.0706 991.0647 992.3988 994.1093 998.6274 1009.3267 1013.5092 1026.5190 1027.5687 1033.5785 1059.4925 1078.6893 1086.4968 1095.7997 1107.1331 1171.2014 1171.6520 1173.2702 1184.2344 1189.0046 1189.4131 1191.9202 1203.5936 1209.6788 1239.9765 1272.1412 1295.4609 1312.1517 1332.1924 1336.0560 1346.1443 1381.8610 1382.4652 1386.8867 1389.1970 1435.2866 1440.6953 1441.4001 1471.8627 1477.5099 1479.0437 1481.5615 1487.1019 1557.4205 1590.8419 1591.9376 1593.7963 1607.5555 1610.6003 1613.4714 2981.5731 3006.8133 3022.8263 3074.3119 3093.6417 3112.4338 3115.0152 3119.0695 3122.7882 3128.9542 3131.4186 3134.6263 3140.0104 3141.7654 3144.9032 3152.4096 3160.7026 3161.5924 3162.1963 3170.8325
redmass: 5.7939 4.2123 3.7807 4.3207 4.2690 4.0426 4.2866 4.7936 6.9883 4.5615 5.4297 2.5601 1.2533 4.0345 4.3955 2.9084 7.3299 3.8740 2.7881 2.8291 2.8356 4.6636 3.9111 4.5055 3.3294 3.4863 4.3574 4.2384 6.4182 6.4232 6.3401 6.1230 4.1719 1.7680 1.6704 1.7637 2.8928 1.9798 1.9949 2.6202 3.1441 3.0059 1.2735 1.3041 1.2560 2.2106 1.4840 1.5417 1.4571 1.3985 1.4574 2.4520 2.4636 4.2084 3.0271 1.5987 2.1163 1.5095 1.3670 2.3678 2.1135 2.1908 1.8358 2.3031 1.6824 1.5921 1.8771 2.1414 1.0567 1.0876 1.0670 1.8737 1.2036 1.1286 1.1380 1.6275 2.2298 1.7052 2.2821 1.5260 1.3187 1.3220 1.2740 1.2946 6.8856 5.1370 9.1642 1.2972 2.2598 2.1699 2.1748 1.1007 2.1815 2.1701 1.3789 1.4476 7.7770 6.1324 6.0712 6.2346 5.9860 6.2873 6.1376 1.0372 1.0818 1.0849 1.0979 1.0997 1.0856 1.0867 1.0865 1.0863 1.0852 1.0913 1.0914 1.0884 1.0959 1.0960 1.0925 1.1014 1.0958 1.1012 1.1006
irintensity: 1.0075 0.2608 0.0792 0.0300 0.2425 0.1529 0.3964 0.6111 3.6797 0.0767 1.7348 0.2005 0.4948 0.8308 3.0289 0.1766 5.5711 0.1190 0.1365 0.0076 0.0088 0.3766 2.3033 0.0959 8.8214 31.4759 2.0570 26.8135 0.1439 0.1756 0.5602 12.6457 3.4848 57.6293 88.3432 28.2697 20.5950 8.7033 81.6903 7.8013 4.7027 6.1205 0.5139 0.8819 0.6863 10.4307 3.5395 2.3060 2.7534 0.4827 1.0267 14.3988 7.8463 0.9289 0.5359 1.8689 18.1432 15.5994 2.4177 5.9746 4.8364 8.0857 0.7333 3.3095 14.5216 8.0806 12.5820 11.6090 0.0802 1.1196 4.6539 25.6360 9.7918 3.1130 1.8790 0.1397 77.0011 39.1690 108.4680 18.4809 0.4587 26.4402 2.2022 16.3930 0.4921 1.3903 2.6125 13.9582 23.8102 0.4890 15.3857 2.6570 5.6829 14.5237 14.4821 21.1184 107.4720 4.6910 5.2480 8.7061 12.2308 7.6429 6.3261 26.2313 2.4496 16.8611 29.0910 29.6698 9.5827 8.0594 2.9243 0.2959 0.2423 15.0654 12.8323 7.2040 40.1990 29.7564 17.6164 25.6510 31.3014 22.5040 17.8936
temp: 298.150 k
press: 1.00000 atm
elementType: 8 6 6 6 6 6 6 6 6 6 6 6 6 6 6 6 6 6 6 6 6 6 6 1 1 1 1 1 1 1 1 1 1 1 1 1 1 1 1 1 1 1 1
symmnumber: 1
zpe: 920096.1 jmol-1
zpe.correction: 0.350446 hartree
zpe.thermalcorrener: 0.370396 hartree
zpe.thermalcorrenthalpy: 0.371340 hartree
zpe.thermalcorrgfe: 0.299239 hartree
zpe.sumelectzpe: -923.962322 hartree
zpe.sumelectthermal: -923.942372 hartree
zpe.sumelectthermalent: -923.941428 hartree
zpe.sumelectthermalfe: -924.013529 hartree
dipole: 0.8075 0.6667 2.7239
dipole: 2.9183
quadrupole: -120.3872 -134.2058 -128.3049
quadrupole: -5.0168 4.1657 -2.8451
quadrupole: 7.2455 -6.5732 -0.6723 -5.0168 4.1657 -2.8451
hfenergy: -924.3127682 hartree
pointgroup: C01 [X(C22H20O1)]
dipole: -0.3541732 0.2492855 -1.0633143 debye
polarizability: 283.7061631|19.140166|184.9874115|-7.2058082|0.3747304|218.5532082 unknown
InChI: InChI=1S/C22H20O/c1-17(18-11-5-2-6-12-18)21(19-13-7-3-8-14-19)22(23)20-15-9-4-10-16-20/h2-17,21H,1H3
charge 0 multiplicity 1
43 atoms
O  -1.482122 -0.56537 2.283962
C  0.841638 -1.480961 0.884835
C  -0.183281 -0.489363 0.221017
C  2.179618 -1.455605 0.142686
C  0.375499 0.940051 0.117529
C  0.259606 -2.91573 0.964856
C  -1.502811 -0.440874 1.021474
C  -2.80477 -0.212342 0.30662
C  3.327956 -0.88515 0.746411
C  2.307796 -1.997555 -1.163651
C  0.773731 1.4668 -1.136285
C  0.534987 1.74066 1.278321
C  1.326839 2.763124 -1.23225
C  1.08655 3.037141 1.183647
C  4.569241 -0.855945 0.070839
C  3.54445 -1.970033 -1.844834
C  -2.884053 0.126188 -1.071546
C  -4.007008 -0.33117 1.058084
C  1.484652 3.554086 -0.071268
C  4.682783 -1.398264 -1.229437
C  -4.138401 0.334778 -1.683637
C  -5.258389 -0.130997 0.444983
C  -5.327906 0.201822 -0.930049
H  1.001378 -1.122605 1.919138
H  -0.388643 -0.858803 -0.801132
H  -0.008601 -3.304752 -0.035597
H  -0.642924 -2.939298 1.598636
H  1.003325 -3.605409 1.401882
H  0.672604 0.850581 -2.038649
H  0.217649 1.349618 2.25216
H  3.245792 -0.456316 1.752556
H  1.438219 -2.455291 -1.651775
H  1.638446 3.151851 -2.208378
H  1.202177 3.645885 2.087728
H  5.444274 -0.409745 0.557212
H  3.622978 -2.396789 -2.851654
H  -1.973191 0.251101 -1.664706
H  -3.926655 -0.581684 2.121061
H  1.911596 4.560751 -0.143539
H  5.643942 -1.377995 -1.755522
H  -4.189728 0.603752 -2.744278
H  -6.178365 -0.231396 1.031199
H  -6.300982 0.359554 -1.408747
