program: Gaussian 09
title: 000233408
version: EM64L-G09RevD.01
frameworkgroup: C1[X(C12H19N)]
method: RPBEPBE
basis: SDD
operation: Freq
keyword: #pfreq=noraman
keyword: PBEPBE/SDD
title: #p freq=noraman PBEPBE/SDD
converged: YES YES NO NO
title: Mulliken charges:
elementType: N C C C C C C C C C C C C H H H H H H H H H H H H H H H H H H H
charge: -0.086617 0.400295 0.131089 -0.550700 0.373336 -0.677067 0.485212 -0.600021 -0.859949 -0.837917 -0.821949 -0.619966 -0.613614 0.217572 0.200067 0.238648 0.231817 0.289224 0.223374 0.226769 0.228468 0.228762 0.226994 0.218185 0.253391 0.181898 0.224335 0.187985 0.223418 0.225878 0.223067 0.228016
chargesum: 0.00000
title: Mulliken charges with hydrogens summed into heavy atoms:
elementType: N C C C C C C C C C C C C
charge: -0.086617 0.400295 0.131089 -0.133061 0.373336 -0.438418 0.485212 -0.368204 -0.120581 -0.153693 -0.144988 0.033509 0.022124
polarizability: 1.67394891e+02 -4.50886797e+00 1.51762606e+02 8.74512867e+00 2.56822793e+00 9.39768525e+01
1716.lowfreq: -8.7586 -3.7277 -0.0005 -0.0003 0.0003 10.6878 36.8060 47.7417 66.9946
frequency: 36.6287 47.3161 66.9792 71.0070 93.8280 134.7343 162.4260 195.9177 225.0232 236.2822 249.6434 259.4768 290.7396 316.1435 334.1611 344.9048 347.4315 428.8531 453.9826 493.2055 534.7392 548.8937 558.7716 666.9942 726.6092 744.8349 809.1940 874.0094 900.4181 910.0553 948.4264 981.5556 1000.0726 1017.7088 1024.8728 1028.9374 1035.9545 1048.7849 1055.7053 1084.5596 1092.1192 1129.6747 1152.2852 1166.7499 1219.5907 1244.6254 1256.2295 1276.6152 1311.6745 1359.6857 1369.4709 1389.7772 1396.1114 1399.8059 1415.2236 1417.1355 1439.7538 1454.8520 1455.1308 1459.1124 1465.9473 1470.8192 1472.7146 1474.9324 1477.4047 1481.8168 1486.3451 1492.4869 1505.2311 1591.8417 1622.3804 2838.0419 2843.6521 2860.8158 2959.8337 2968.8188 2972.5282 2994.9002 3014.7609 3028.5395 3042.7063 3048.2453 3049.9636 3074.3977 3079.2402 3079.8084 3086.1893 3092.0745 3103.4138 3107.7548
redmass: 1.0390 2.0283 2.8211 1.9301 1.6908 2.4009 1.1780 2.5531 1.3554 1.1783 2.2616 2.1920 2.5580 2.7096 3.0577 2.5073 1.9937 2.3474 4.5897 2.6699 3.4670 3.9638 3.1297 4.1087 3.4392 3.2026 3.6223 1.4157 1.5708 1.9043 2.8801 1.6208 1.7597 1.5887 1.6660 1.6481 1.5589 1.5518 1.6600 1.6825 1.4622 1.4740 2.4013 1.8925 1.8547 1.6712 2.1657 1.4784 4.4648 1.5256 5.1887 1.2341 1.2509 1.2595 2.5582 1.1433 1.1974 1.0797 1.4818 1.0491 1.1152 1.0466 1.0638 1.0532 1.0939 1.1345 1.0569 1.7430 1.0552 6.3197 6.1612 1.0693 1.0574 1.0587 1.0421 1.0379 1.0371 1.0864 1.0718 1.0725 1.0958 1.0914 1.0975 1.1010 1.0986 1.0986 1.0996 1.1002 1.0907 1.0916
irintensity: 0.3638 0.4031 0.4865 0.6068 0.8419 2.4226 0.5563 2.8927 0.7508 0.2562 0.1944 1.7526 2.5027 2.4150 2.2812 3.9222 3.6746 0.6194 0.1564 0.2515 1.9051 1.4825 4.2402 5.0690 0.4180 1.5340 23.9428 22.0924 0.6949 5.8959 1.7577 7.2331 27.5502 11.2341 9.9136 27.9448 13.0019 17.4852 2.6113 3.1081 5.5421 6.8134 2.1664 4.4398 0.0757 4.0330 4.7339 6.5328 2.5422 14.6998 1.3150 6.2863 16.6180 14.3777 4.0908 3.5404 6.2049 2.3745 5.6645 14.2123 1.8681 13.4027 16.0486 11.3730 24.8840 7.9149 14.6772 32.2319 6.7006 4.2887 9.8307 49.3946 67.9632 259.4576 41.0378 38.4665 42.2780 28.0173 43.4307 35.7063 33.3246 12.0769 23.5679 34.5079 15.5479 24.8472 2.1767 31.6837 32.5615 15.4083
temp: 298.150 k
press: 1.00000 atm
elementType: 7 6 6 6 6 6 6 6 6 6 6 6 6 1 1 1 1 1 1 1 1 1 1 1 1 1 1 1 1 1 1 1
symmnumber: 1
zpe: 732611.1 jmol-1
zpe.correction: 0.279037 hartree
zpe.thermalcorrener: 0.294240 hartree
zpe.thermalcorrenthalpy: 0.295184 hartree
zpe.thermalcorrgfe: 0.236510 hartree
zpe.sumelectzpe: -522.410229 hartree
zpe.sumelectthermal: -522.395026 hartree
zpe.sumelectthermalent: -522.394082 hartree
zpe.sumelectthermalfe: -522.452756 hartree
dipole: -0.3594 -0.3581 -0.1163
dipole: 0.5205
quadrupole: -73.5214 -76.6672 -81.9554
quadrupole: 1.2724 1.9458 -0.3020
quadrupole: 3.8599 0.7141 -4.5741 1.2724 1.9458 -0.3020
hfenergy: -522.6892662 hartree
pointgroup: C01 [X(C12H19N1)]
dipole: -0.1547414 -0.1215019 -0.0567699 debye
polarizability: 166.5041164|-6.7190373|151.8752418|7.7926334|7.4643618|94.7549911 unknown
InChI: InChI=1S/C12H19N/c1-9-6-10(2)11(3)12(7-9)8-13(4)5/h6-7H,8H2,1-5H3
charge 0 multiplicity 1
32 atoms
N  -2.687943 0.138756 0.267433
C  -0.294875 -0.185833 -0.484841
C  0.392393 1.004403 -0.104979
C  -1.772334 -0.169631 -0.866553
C  1.786165 0.926734 0.200952
C  0.406187 -1.415848 -0.551057
C  1.783492 -1.508378 -0.247387
C  2.454369 -0.318649 0.126671
C  -0.334938 2.339247 -0.054057
C  2.567728 2.168856 0.599305
C  2.525212 -2.832289 -0.328347
C  -2.604238 -0.850209 1.360995
C  -4.075751 0.337195 -0.196444
H  -1.951913 0.603685 -1.639848
H  -2.031626 -1.155289 -1.333188
H  -0.141268 -2.320581 -0.847354
H  3.525797 -0.36055 0.364675
H  -1.409566 2.183324 0.135446
H  0.061745 2.988263 0.746366
H  -0.216805 2.895832 -1.006433
H  2.487948 2.965568 -0.164287
H  2.1952 2.600071 1.548962
H  3.63795 1.936323 0.734692
H  -3.239519 -0.522173 2.203274
H  -1.56396 -0.924673 1.718466
H  -2.938339 -1.874139 1.051016
H  -4.713067 0.63572 0.655119
H  -4.525183 -0.580157 -0.65711
H  -4.106955 1.145815 -0.949473
H  3.025612 -3.075248 0.627982
H  1.840621 -3.663624 -0.57063
H  3.310664 -2.807421 -1.107864
