program: Gaussian 09
title: 000233401
version: EM64L-G09RevD.01
frameworkgroup: C1[X(C11H10N2O)]
method: RPBEPBE
basis: SDD
operation: Freq
keyword: #p
keyword: freq=noraman
keyword: PBEPBE/SDD
title: #p freq=noraman PBEPBE/SDD
converged: YES YES NO NO
title: Mulliken charges:
elementType: O N N C C C C C C C C C C C H H H H H H H H H H
charge: -0.233412 -0.413343 -0.064328 0.100750 0.325813 0.394116 -0.402970 -0.352287 -0.348418 -0.784025 -0.030009 -0.250413 -0.230027 -0.228836 0.228146 0.333887 0.212577 0.300326 0.249403 0.249462 0.251408 0.227940 0.232440 0.231801
chargesum: 0.00000
title: Mulliken charges with hydrogens summed into heavy atoms:
elementType: O N N C C C C C C C C C C C
charge: -0.233412 -0.079456 -0.064328 0.100750 0.325813 0.394116 -0.174824 -0.139710 -0.048092 -0.033752 -0.030009 -0.022474 0.002413 0.002964
polarizability: 2.23079101e+02 -4.27273985e+00 1.50844736e+02 8.42351981e-02 4.08303504e-01 5.78234728e+01
1716.lowfreq: -7.5588 -0.0006 -0.0005 0.0001 3.3385 5.4959 14.8642 73.6706 95.3884
frequency: 14.5861 73.6632 95.3868 125.4501 135.2187 195.9023 227.3792 265.9087 328.4279 361.3149 399.3476 454.9516 502.2727 545.9472 571.1193 586.8144 615.7572 652.4469 661.5077 692.5113 723.4075 771.8841 784.4789 824.9594 855.7902 858.5041 885.9362 941.5330 977.7040 989.0809 990.3454 1017.9918 1023.1079 1026.9502 1051.5861 1055.8776 1083.7456 1145.8910 1172.6966 1189.1202 1205.9831 1286.5796 1316.1747 1376.7677 1389.8215 1401.4408 1405.4324 1438.3327 1465.8191 1466.9923 1487.9079 1512.7783 1586.3088 1608.8561 1618.3983 1644.2598 2985.7267 3064.0018 3115.2913 3127.3939 3138.2571 3150.8728 3162.3006 3172.1941 3202.2022 3510.3884
redmass: 3.8354 2.0121 1.5115 5.5062 4.7152 3.3621 5.7652 4.1255 4.5725 6.0277 2.7806 3.5646 6.2028 5.2778 3.7922 7.0214 6.4414 6.8671 2.6454 1.5792 1.6817 3.0392 1.4697 2.1084 1.2590 6.4340 5.8199 1.4471 2.7989 1.3718 5.7281 1.3471 2.6398 2.0380 1.5536 2.6849 1.6987 3.9769 1.0641 1.2960 1.4549 2.2079 1.3651 2.7446 7.0609 2.5263 1.2516 2.3407 1.0429 1.2133 2.5293 4.7075 6.1188 6.0114 5.5132 6.8392 1.0387 1.0979 1.0976 1.0849 1.0884 1.0932 1.0966 1.0992 1.0923 1.0778
irintensity: 2.0750 2.6759 0.1071 1.1824 4.5304 0.1162 0.5034 0.4485 0.4541 3.3649 0.0046 1.0600 0.4916 2.4143 5.7564 0.1014 0.0571 7.5583 20.1731 42.5687 22.3551 88.7465 63.3760 6.2253 0.0869 4.2811 15.5301 3.3374 0.8729 0.4900 1.5735 1.1522 0.6150 11.0117 13.2683 13.1473 29.4993 10.1416 2.4238 13.2590 7.7096 105.3264 0.3059 57.5125 24.3085 50.3096 22.5002 29.9315 17.3585 84.4734 22.7667 41.6760 22.7114 142.7471 291.3027 661.2965 19.1649 10.6315 9.9629 0.4716 8.5109 31.1260 15.1956 22.3327 4.2133 52.5541
temp: 298.150 k
press: 1.00000 atm
elementType: 8 7 7 6 6 6 6 6 6 6 6 6 6 6 1 1 1 1 1 1 1 1 1 1
symmnumber: 1
zpe: 488776.1 jmol-1
zpe.correction: 0.186165 hartree
zpe.thermalcorrener: 0.197984 hartree
zpe.thermalcorrenthalpy: 0.198928 hartree
zpe.thermalcorrgfe: 0.146514 hartree
zpe.sumelectzpe: -608.933648 hartree
zpe.sumelectthermal: -608.921829 hartree
zpe.sumelectthermalent: -608.920885 hartree
zpe.sumelectthermalfe: -608.973299 hartree
dipole: -0.2970 -6.7819 0.0530
dipole: 6.7886
quadrupole: -61.2399 -85.9847 -85.3660
quadrupole: 16.1273 -0.0940 0.2537
quadrupole: 16.2903 -8.4545 -7.8357 16.1273 -0.0940 0.2537
hfenergy: -609.1198131 hartree
pointgroup: C01 [X(C11H10N2O1)]
dipole: -0.0473744 -2.6586785 0.2499793 debye
dipolederiv: -0.8262749 0.5212274 -0.0631335 0.4932381 -1.1359756 0.0863252 -0.0624544 0.08726 -0.404069 -0.6988102 -0.304544 0.0140439 0.5399578 -0.8466565 0.0754362 -0.068282 0.0432259 -0.2624726 -1.2600857 0.6771223 -0.0979874 0.3687541 -0.7828186 0.0629715 -0.0679997 0.0719116 -0.2640724 1.6431264 0.00582 0.0508307 0.1951702 0.8693348 -0.0666418 0.027727 -0.0694251 0.1316855 -0.5757936 0.0023692 -0.0199771 -0.0276038 -0.0292252 -0.0002909 -0.013341 -0.0005666 -0.0218975 1.2120425 0.2857562 0.0118989 -0.429578 0.4507115 -0.0510231 0.0785948 -0.025506 0.0897001 -1.1354124 -0.4408089 0.0116516 -0.4040398 -0.4288862 0.0046064 0.0077006 0.0029395 -0.212414 0.1114325 0.0734701 0.0053597 -0.1361863 0.0211104 -0.0137721 0.0246738 -0.0059829 -0.1399628 0.0164504 -0.10223 0.0104418 0.1334797 -0.0157333 -0.0008244 -0.0101594 -0.0108547 -0.1091826 -0.1203362 -0.16922 0.0104508 -0.0523987 -0.0941044 0.0116169 0.0003086 0.0086834 0.0472393 1.3700734 -0.6553125 0.0982591 -0.6545865 1.6669843 -0.1538662 0.1037386 -0.1522166 0.2695792 -0.174562 -0.1186116 0.0067016 -0.2487688 0.0642545 -0.0230077 0.0144776 -0.0185589 -0.1571977 -0.1185159 0.1536269 -0.0085249 0.2170691 0.095304 -0.0092071 -0.0130823 -0.0121396 -0.1548685 0.0966813 -0.0019503 0.0082334 0.0311285 -0.004155 -0.0079507 0.0060204 -0.0089818 -0.143227 0.1119498 0.0612015 -0.0083461 0.0499879 -0.0435843 0.0233724 -0.0083165 0.0232006 0.1689175 0.1877463 -0.0146627 -0.0028382 -0.026005 0.1741703 0.0116664 -0.0014112 0.0115239 0.306527 0.0654239 -0.1095351 0.0040069 -0.1033067 -0.0575772 0.0089393 0.0033241 0.0093732 0.1425794 0.1624595 0.0682873 -0.0032718 0.0468903 0.0392317 0.0085328 -0.0001388 0.0108978 0.1519038 0.0139299 -0.0424776 -0.0898849 -0.0261666 0.0705316 0.0301808 -0.12325 -0.0233817 -0.0262399 -0.0018594 -0.0257633 0.0981155 0.0002541 0.0653209 -0.0473148 0.1273827 0.0047807 -0.0058469 0.0447781 0.1382541 -0.015976 0.0306672 -0.0389346 0.0166712 -0.0055776 0.0203205 0.1202593 0.0079925 0.0820972 -0.0104916 0.1159501 -0.0696859 0.0187117 -0.0131722 0.0174294 0.1584874 0.0087025 -0.0816759 0.000386 -0.1124879 -0.064348 0.0107553 0.0028618 0.0117227 0.156154 -0.1411387 -0.0024405 -0.0099485 -0.0014191 0.0947308 0.0041128 -0.0096249 0.0043447 0.1584183 unknown
polarizability: 223.0656431|-1.8917699|150.03514|5.7592903|-7.651736|58.6465271 unknown
InChI: InChI=1S/C11H10N2O/c1-8-7-10(13-11(14)12-8)9-5-3-2-4-6-9/h2-7,12H,1H3
charge 0 multiplicity 1
24 atoms
O  -2.834693 2.401249 -0.41562
N  -2.967229 0.084404 -0.206563
N  -0.818719 1.179375 -0.234355
C  -0.243821 -0.036245 -0.099677
C  1.248762 -0.061492 -0.047535
C  -2.404693 -1.167997 -0.065972
C  -1.01874 -1.253313 -0.008824
C  1.987988 -1.271828 0.056765
C  1.959201 1.169817 -0.106002
C  -3.340211 -2.34881 0.015524
C  -2.20908 1.313876 -0.293822
C  3.398153 -1.250665 0.102337
C  3.36651 1.18976 -0.059698
C  4.093477 -0.020712 0.044961
H  -0.551089 -2.230541 0.106054
H  -3.984211 0.2015 -0.253699
H  1.477679 -2.239413 0.100182
H  1.372895 2.089825 -0.188498
H  -3.961852 -2.428073 -0.896015
H  -4.023916 -2.256849 0.88026
H  -2.773313 -3.285839 0.125706
H  3.953826 -2.191503 0.181777
H  3.898798 2.146131 -0.105363
H  5.18858 -0.005954 0.080675
