program: Gaussian 09
title: 000233422
version: EM64L-G09RevD.01
frameworkgroup: C1[X(C17H31N)]
method: RPBEPBE
basis: SDD
operation: Freq
keyword: #pfreq=noraman
keyword: PBEPBE/SDD
title: #p freq=noraman PBEPBE/SDD
converged: YES YES NO NO
title: Mulliken charges:
elementType: N C C C C C C C C C C C C C C C C C H H H H H H H H H H H H H H H H H H H H H H H H H H H H H H H
charge: -0.096696 0.261332 0.352400 -0.610348 -0.466861 -0.620221 -0.838035 0.174373 0.442281 -0.530540 -0.380029 -0.836928 -0.336172 -0.844404 -0.643101 -0.646436 -0.362812 -0.696520 0.236519 0.213839 0.246958 0.215447 0.222769 0.206210 0.208467 0.239958 0.215196 0.224150 0.205659 0.186482 0.223995 0.230516 0.225170 0.186902 0.187925 0.224928 0.227766 0.219304 0.238176 0.218404 0.193301 0.192319 0.220568 0.239663 0.197263 0.195015 0.215564 0.210181 0.210102
chargesum: 0.00000
title: Mulliken charges with hydrogens summed into heavy atoms:
elementType: N C C C C C C C C C C C C C C C C C
charge: -0.096696 0.261332 0.352400 -0.159989 -0.004456 -0.191242 -0.174413 0.174373 0.442281 -0.306389 0.012111 -0.157247 0.038655 -0.172405 0.006780 0.006115 0.029466 -0.060674
polarizability: 2.35891502e+02 2.89053285e+00 1.95606481e+02 3.17422573e+00 9.66975468e+00 1.55700077e+02
1716.lowfreq: -9.7327 -0.0006 -0.0005 0.0001 6.8507 9.3248 23.5969 40.4555 49.9860
frequency: 22.0583 40.4152 49.9031 63.7421 67.1748 79.6976 85.5976 93.0731 122.4272 132.3835 135.3000 162.1200 177.3640 194.2713 218.3283 226.2500 230.2595 235.1447 253.5953 270.0357 288.5893 310.0490 318.0875 330.9083 376.8877 382.2214 398.3631 417.8602 430.9203 441.3035 460.4056 471.4387 512.0208 540.1455 591.1896 647.1299 724.5116 734.3833 751.6562 783.6346 825.0792 832.6368 854.7943 878.2434 884.0195 892.0192 901.8871 956.1212 958.5898 967.1713 989.8292 996.9642 1017.9026 1030.5590 1034.5394 1036.8480 1039.1401 1039.4643 1074.2681 1085.6701 1093.7746 1100.9637 1108.3319 1125.8674 1131.6024 1146.7443 1179.1779 1197.4721 1214.9825 1221.6146 1231.7922 1240.2123 1258.6468 1268.5699 1273.3491 1284.0290 1289.5433 1296.7346 1324.8550 1328.8297 1336.1054 1346.1585 1349.9084 1369.1397 1375.7141 1388.4521 1390.8448 1393.1367 1418.9294 1436.2382 1441.8785 1455.3372 1458.1770 1461.0913 1463.8236 1465.4925 1466.9603 1468.0076 1469.8518 1473.9257 1475.0542 1477.0151 1478.0756 1479.9039 1485.4080 1487.1788 1493.6141 1505.2648 1608.4136 1666.5972 2847.0659 2858.6960 2922.3144 2949.6443 2950.2396 2960.0349 2963.4238 2964.3919 2969.9585 2970.7176 2971.6294 2986.4808 2989.4979 3004.5967 3010.2234 3010.7199 3014.6496 3015.7690 3025.6486 3028.8106 3030.4767 3045.6178 3061.5896 3068.2632 3070.5651 3070.9316 3072.6968 3076.5780 3083.2204 3091.9592 3097.6152
redmass: 3.2209 3.2689 1.6594 1.8226 1.4827 2.6079 2.6909 2.6007 2.3691 2.3211 2.5740 1.2170 2.8856 1.9796 2.7530 1.1277 1.1128 1.2773 2.3173 2.1675 2.0276 2.5402 1.7754 2.1276 2.5286 2.3383 2.2710 2.7381 2.6536 1.8443 3.0839 3.2163 3.3403 3.1293 3.1814 3.7119 1.1023 2.1552 1.4322 3.2439 1.6234 2.5138 1.6631 2.1216 1.7977 1.8375 1.9756 1.3453 1.7521 1.5948 3.1108 1.6985 1.5155 1.5870 1.9288 2.0374 1.5454 2.1734 2.4040 1.4301 1.6144 1.9278 2.1791 1.8877 1.5706 2.1150 2.0551 1.7049 1.5830 1.7813 1.8867 1.7928 1.9118 2.4097 1.6613 1.0744 1.1505 1.3589 2.0710 1.4381 1.4929 1.3861 1.4655 2.2399 1.2227 1.2149 1.2319 1.2539 1.1373 1.1247 1.0881 1.0498 1.0776 1.0718 1.0720 1.0767 1.0648 1.0729 1.0704 1.0535 1.0652 1.0455 1.0679 1.0536 1.0590 1.0765 1.0627 1.0716 6.9393 6.4114 1.0571 1.0569 1.0660 1.0383 1.0581 1.0596 1.0415 1.0570 1.0522 1.0400 1.0383 1.0597 1.0977 1.0909 1.0744 1.0998 1.0736 1.0951 1.1024 1.1019 1.0967 1.1037 1.0990 1.1007 1.0993 1.0979 1.0984 1.0991 1.0987 1.0909 1.0944
irintensity: 0.0161 0.0966 0.0258 0.1504 0.5017 0.1147 0.0807 0.0757 0.4949 0.6724 0.0486 1.6748 0.4474 0.4141 2.1222 0.5119 0.0039 0.5525 0.7467 0.2194 0.9160 6.4904 0.3083 0.5119 0.1101 0.2085 2.6508 0.7425 4.1640 0.7437 4.2229 5.0202 0.3567 8.3621 0.5696 1.1666 9.8942 1.9587 1.6327 10.8278 4.4359 3.1476 9.2664 4.3990 6.0014 6.3137 6.3063 0.4000 0.6462 5.1220 1.0941 16.2513 6.0092 2.3004 3.2707 89.4439 16.9155 2.5595 0.9477 0.8092 14.5866 1.3737 14.6800 1.2901 7.6811 1.6946 0.7079 0.1301 2.0644 4.7632 4.3798 1.2750 2.5749 17.6010 2.7636 0.8247 2.2911 0.1525 4.4223 2.4770 5.2394 1.6397 0.7947 6.6410 20.1412 10.9964 12.0156 7.3067 4.6689 6.6588 9.1566 9.6563 7.6692 1.2187 8.3668 15.1025 3.8845 4.2983 3.9396 8.6012 23.4912 16.4289 2.6545 3.3986 2.7542 9.0477 24.8000 1.5168 0.0071 13.9156 75.6403 226.1440 39.8249 69.2910 9.9918 33.8988 38.3419 26.0212 76.6742 13.3372 38.0234 74.7018 1.1368 5.6360 34.0987 2.3799 56.1614 32.2675 7.1878 10.6340 23.0169 82.3745 41.0239 91.2234 53.9905 31.3683 28.0995 29.5662 32.1232 27.9591 43.8006
temp: 298.150 k
press: 1.00000 atm
elementType: 7 6 6 6 6 6 6 6 6 6 6 6 6 6 6 6 6 6 1 1 1 1 1 1 1 1 1 1 1 1 1 1 1 1 1 1 1 1 1 1 1 1 1 1 1 1 1 1 1
symmnumber: 1
zpe: 1155314.0 jmol-1
zpe.correction: 0.440036 hartree
zpe.thermalcorrener: 0.462614 hartree
zpe.thermalcorrenthalpy: 0.463559 hartree
zpe.thermalcorrgfe: 0.388176 hartree
zpe.sumelectzpe: -719.658833 hartree
zpe.sumelectthermal: -719.636254 hartree
zpe.sumelectthermalent: -719.635310 hartree
zpe.sumelectthermalfe: -719.710693 hartree
dipole: 0.0358 0.5253 -0.5456
dipole: 0.7582
quadrupole: -111.7794 -111.6374 -115.2072
quadrupole: -0.7981 1.4598 0.7561
quadrupole: 1.0953 1.2373 -2.3326 -0.7981 1.4598 0.7561
hfenergy: -720.0988684 hartree
pointgroup: C01 [X(C17H31N1)]
dipole: 0.0202342 -0.2025193 0.218103 debye
polarizability: 234.0112873|-4.9820424|196.6618551|-10.1051927|9.5391612|156.524917 unknown
InChI: InChI=1S/C17H31N/c1-7-8-9-10-16-15(3)11-14(2)12-17(16,4)13-18(5)6/h11H,7-10,12-13H2,1-6H3
charge 0 multiplicity 1
49 atoms
N  -1.893537 -2.22264 0.560951
C  -0.90445 -0.200477 -0.687704
C  0.117764 0.940121 -0.440869
C  -2.332593 0.380384 -0.884653
C  -0.907383 -1.114729 0.605866
C  1.54427 0.794663 -0.956589
C  -0.578521 -1.070578 -1.924205
C  -0.294083 2.030185 0.301792
C  -2.711759 1.42715 0.14865
C  -1.709647 2.174276 0.704541
C  2.493992 -0.076878 -0.082506
C  0.613794 3.169485 0.744113
C  3.932754 -0.127615 -0.644185
C  -4.177941 1.646395 0.443649
C  -2.912334 -2.177069 1.626009
C  -1.307502 -3.565315 0.398222
C  4.887688 -1.005847 0.196303
C  6.321493 -1.054809 -0.375268
H  -3.039974 -0.472924 -0.864201
H  -2.414423 0.835483 -1.898466
H  -1.118489 -0.462075 1.474563
H  0.116531 -1.515959 0.751805
H  1.527858 0.360991 -1.975426
H  2.007599 1.793066 -1.066613
H  0.395776 -1.586085 -1.833119
H  -1.362396 -1.840884 -2.038985
H  -0.558458 -0.461023 -2.847354
H  -1.954346 2.965764 1.427304
H  2.50733 0.324494 0.951184
H  2.097978 -1.109972 -0.01086
H  0.508729 3.338542 1.833895
H  0.330874 4.119803 0.248862
H  1.680161 2.984921 0.540344
H  4.341132 0.90342 -0.703615
H  3.906371 -0.510032 -1.686512
H  -4.734996 1.882638 -0.486287
H  -4.336487 2.474987 1.15646
H  -4.651976 0.735261 0.861745
H  -3.371463 -1.174029 1.662125
H  -3.711567 -2.911876 1.412888
H  -2.504302 -2.40204 2.6443
H  -0.741056 -3.914098 1.299626
H  -2.107512 -4.302464 0.19743
H  -0.616328 -3.575741 -0.461334
H  4.914976 -0.6217 1.236431
H  4.477344 -2.034748 0.256543
H  6.983717 -1.688845 0.242752
H  6.765983 -0.042414 -0.417723
H  6.323904 -1.464359 -1.403181
