program: Gaussian 09
title: 000233374
version: EM64L-G09RevD.01
frameworkgroup: C1[X(C13H13N3O2S)]
method: RPBEPBE
basis: SDD
operation: Freq
keyword: #p
keyword: freq=noraman
keyword: PBEPBE/SDD
title: #p freq=noraman PBEPBE/SDD
converged: YES YES NO NO
title: Mulliken charges:
elementType: S O O N N N C C C C C C C C C C C C C H H H H H H H H H H H H H
charge: 0.860930 -0.583305 -0.521868 -0.380129 -0.657941 -0.689680 -0.056170 -0.223017 -0.206749 0.325456 0.226055 0.512721 -0.389636 -0.388440 -0.383987 -0.335597 -0.226035 -0.219888 -0.225107 0.279574 0.271500 0.228236 0.227191 0.239864 0.276988 0.231333 0.233317 0.233229 0.322988 0.393374 0.312670 0.312124
chargesum: 0.00000
title: Mulliken charges with hydrogens summed into heavy atoms:
elementType: S O O N N N C C C C C C C C C C C C C
charge: 0.860930 -0.583305 -0.521868 -0.380129 0.058421 -0.064886 -0.056170 0.056557 0.064751 0.325456 0.226055 0.512721 -0.161400 -0.161249 -0.144124 -0.058609 0.005298 0.013429 0.008122
polarizability: 2.92028890e+02 9.18257938e+00 1.64305597e+02 -1.24842924e+01 -1.54260059e+01 1.68945729e+02
1716.lowfreq: -11.5164 -4.0082 -0.0019 -0.0015 0.0007 2.3984 22.6396 25.6479 30.7321
frequency: 22.5662 25.6210 30.6765 64.7681 85.6400 96.6689 136.7933 146.8404 195.4731 204.6791 238.3646 265.2846 286.5249 302.4256 351.1647 393.0798 400.5610 405.4312 406.6609 410.7726 413.6562 418.2643 443.4560 468.9685 519.6740 525.9981 553.3812 610.2684 613.7457 623.7224 644.4988 665.7821 700.3272 721.7515 761.2681 779.1101 790.2437 809.0927 815.9213 834.1266 844.6180 856.7487 910.4816 936.0843 952.0430 964.5604 982.5433 984.2584 990.0425 1003.1283 1020.9422 1023.8925 1057.0923 1072.5486 1085.1969 1128.9085 1156.8079 1175.0023 1181.5549 1189.5815 1297.7007 1316.5001 1319.4298 1381.6275 1388.8054 1399.4210 1429.4914 1433.1821 1484.9396 1490.6450 1499.2535 1588.1918 1588.9283 1610.2246 1615.7392 1631.0560 1647.4575 3124.8111 3132.3166 3134.5964 3134.7093 3147.8229 3161.9383 3162.4740 3165.3210 3174.5315 3220.1059 3563.8951 3625.1501 3703.1432
redmass: 3.7155 5.4289 4.6582 5.4425 6.7199 5.4580 7.7326 5.2265 6.0053 8.4629 9.3690 8.1787 5.5091 6.3321 4.5075 4.7936 3.3644 1.0418 3.0519 3.5441 2.9194 1.4247 6.9300 4.5099 2.0919 1.5456 5.0492 7.0964 6.4168 6.9179 5.7837 4.9836 1.7756 2.9751 11.4506 2.2422 3.6635 4.8276 1.2715 1.8364 1.1551 1.2449 14.3239 1.4233 1.3610 1.3565 1.4746 4.6273 4.8522 1.3324 1.4298 2.4379 2.5572 2.1938 1.7110 1.1904 2.0701 1.0610 1.1176 1.1153 1.2963 1.3251 2.6669 6.4380 3.9470 5.6516 2.2806 3.7255 2.5070 2.9672 3.6378 5.3263 6.2540 5.7057 4.5990 1.3952 1.2396 1.0860 1.0893 1.0891 1.0883 1.0931 1.0972 1.0952 1.0964 1.0990 1.0669 1.0452 1.0865 1.1040
irintensity: 0.4291 2.7262 1.5004 1.9212 1.4789 1.8409 1.5427 3.3070 1.8060 0.5400 12.2790 3.4375 3.4268 25.2529 19.7423 7.7951 3.5817 1.1002 6.1021 3.7172 1.4089 281.9032 108.0984 115.4338 61.9309 64.9775 71.6995 59.9417 12.4427 0.7824 4.4414 13.2654 50.1826 1.5783 96.5993 55.4053 3.0835 13.3303 1.0252 71.4593 116.1095 1.9727 105.7989 8.8428 1.1083 0.0839 3.0869 2.9952 0.4128 1.1591 0.9852 13.1492 64.8168 1.4997 16.0160 14.4723 3.4022 0.1489 57.3605 5.9274 4.2495 2.5728 85.3270 17.5507 111.4679 6.1256 12.7702 1.2929 4.1489 108.7204 255.9485 19.7384 3.6631 1.4504 192.1774 370.0270 226.0227 2.8914 14.2165 17.0946 2.8882 23.9132 26.0089 1.8533 12.9649 13.9671 206.5911 108.6165 60.3106 24.2618
temp: 298.150 k
press: 1.00000 atm
elementType: 16 8 8 7 7 7 6 6 6 6 6 6 6 6 6 6 6 6 6 1 1 1 1 1 1 1 1 1 1 1 1 1
symmnumber: 1
zpe: 629670.6 jmol-1
zpe.correction: 0.239829 hartree
zpe.thermalcorrener: 0.257714 hartree
zpe.thermalcorrenthalpy: 0.258658 hartree
zpe.thermalcorrgfe: 0.192080 hartree
zpe.sumelectzpe: -1214.435365 hartree
zpe.sumelectthermal: -1214.417480 hartree
zpe.sumelectthermalent: -1214.416535 hartree
zpe.sumelectthermalfe: -1214.483114 hartree
dipole: -0.4007 -5.4164 -3.1101
dipole: 6.2586
quadrupole: -68.6409 -121.7801 -113.2810
quadrupole: 20.6638 -0.5544 -8.3953
quadrupole: 32.5931 -20.5461 -12.0470 20.6638 -0.5544 -8.3953
hfenergy: -1214.6751937 hartree
pointgroup: C01 [X(C13H13N3O2S1)]
dipole: 0.3037355 -2.3904318 0.5066375 debye
polarizability: 289.4223825|1.9466746|155.7130647|-23.2703015|10.5246008|180.1447693 unknown
InChI: InChI=1S/C13H13N3O2S/c14-11-6-8-12(9-7-11)19(17,18)16-13(15)10-4-2-1-3-5-10/h1-9H,14-15H2
charge 0 multiplicity 1
32 atoms
S  0.753594 1.706484 -0.080826
O  0.769979 2.368876 1.444428
O  0.746718 2.693473 -1.374074
N  -0.670292 0.475891 -0.264325
N  -1.866161 1.648303 1.506453
N  5.623119 -1.857562 -0.538153
C  2.235375 0.593823 -0.213833
C  2.804813 0.394699 -1.484262
C  2.762346 0.013435 0.953463
C  -2.923736 -0.173304 0.231036
C  -1.747998 0.714397 0.508765
C  4.50081 -1.043691 -0.430484
C  3.940473 -0.42606 -1.590567
C  3.898527 -0.806287 0.843395
C  -3.831144 -0.526465 1.264498
C  -3.125708 -0.675464 -1.080254
C  -4.93833 -1.35593 0.98212
C  -4.232711 -1.503813 -1.357515
C  -5.14432 -1.843089 -0.329461
H  2.37562 0.89053 -2.360802
H  2.306238 0.22106 1.926593
H  4.401015 -0.592532 -2.571198
H  4.327894 -1.264262 1.741966
H  -3.656703 -0.190353 2.29339
H  -2.409127 -0.402591 -1.860616
H  -5.63164 -1.630265 1.784699
H  -4.387358 -1.882368 -2.373654
H  -6.004834 -2.485436 -0.547006
H  -2.773732 1.838044 1.925205
H  -1.021484 2.188754 1.777296
H  6.062115 -2.024788 -1.438941
H  6.032739 -2.29371 0.282866
