program: Gaussian 09
title: 000022091
version: EM64L-G09RevD.01
frameworkgroup: C1[X(C9H10N2)]
method: RPBEPBE
basis: SDD
operation: Freq
keyword: #pfreq=noraman
keyword: PBEPBE/SDD
title: #p freq=noraman PBEPBE/SDD
converged: YES YES NO NO
title: Mulliken charges:
elementType: N N C C C C C C C C C H H H H H H H H H H
charge: -0.434481 0.008539 0.473097 -0.416119 -0.370714 -0.191495 -0.191299 -0.266065 -0.282185 -0.070006 -0.567295 0.215532 0.272902 0.222983 0.223723 0.227364 0.270246 0.204334 0.239991 0.221809 0.209137
chargesum: 0.00000
title: Mulliken charges with hydrogens summed into heavy atoms:
elementType: N N C C C C C C C C C
charge: -0.164234 0.008539 0.473097 -0.200586 -0.097812 0.031488 0.032424 -0.038700 -0.077851 0.169985 -0.136349
polarizability: 2.78063573e+02 -2.02274058e+00 1.06470636e+02 3.77776777e-03 -3.63417628e-03 4.35297415e+01
1716.lowfreq: -0.0008 -0.0007 0.0004 4.2189 5.6195 15.9774 59.5161 82.2897 96.8832
frequency: 59.5127 82.2774 96.8653 172.1919 225.1349 251.4576 317.4149 322.0557 408.4814 426.1359 507.1127 559.1809 594.5003 615.0841 635.3812 653.8724 695.2293 760.1905 832.2076 838.7538 897.8750 900.7680 923.2406 950.8031 965.8573 981.6608 989.0383 1006.4282 1019.5279 1076.2816 1124.9094 1169.2015 1177.0757 1206.0639 1267.3905 1277.5826 1289.6374 1328.3216 1386.5528 1421.1604 1446.1185 1484.1117 1525.3612 1554.4825 1600.6413 1617.2076 1630.4368 2974.1576 3096.3711 3110.8080 3126.5313 3130.5972 3141.8115 3164.2142 3182.6020 3210.8638 3385.6037
redmass: 4.6985 4.1129 1.9921 3.4485 3.7188 4.5751 2.5062 5.1638 2.9200 3.3013 2.8019 5.3835 1.2353 6.4492 5.1232 1.4566 1.9249 1.7208 1.2604 4.5640 1.4007 1.4397 1.5141 1.4757 1.3523 6.0337 1.3076 1.1202 2.1506 1.7479 3.7200 1.0609 1.1184 2.1378 1.4454 1.9266 1.3393 1.3884 4.4698 1.5594 2.1046 2.2467 2.0081 5.6475 4.9133 6.1440 4.1630 1.0874 1.0602 1.0879 1.0933 1.0866 1.0933 1.0985 1.0958 1.1139 1.0744
irintensity: 0.3616 0.0210 6.6120 1.8802 14.2865 0.7616 22.1819 0.9665 0.0333 0.2225 23.6764 2.2900 42.2364 1.4194 12.0055 28.2136 48.4485 84.0915 0.0452 0.7609 2.1485 16.5858 100.3974 4.1972 0.0000 2.5693 1.5228 37.5876 2.2049 33.4145 147.4105 1.8863 13.1285 70.8896 11.5088 96.7262 35.4907 10.9573 7.5584 9.3781 7.9690 104.2454 116.7626 200.2243 11.5346 209.2383 22.0587 45.8449 6.9172 15.7523 8.8018 0.9023 32.5413 34.4294 3.5863 21.3051 0.6890
temp: 298.150 k
press: 1.00000 atm
elementType: 7 7 6 6 6 6 6 6 6 6 6 1 1 1 1 1 1 1 1 1 1
symmnumber: 1
zpe: 441388.2 jmol-1
zpe.correction: 0.168116 hartree
zpe.thermalcorrener: 0.178185 hartree
zpe.thermalcorrenthalpy: 0.179129 hartree
zpe.thermalcorrgfe: 0.132171 hartree
zpe.sumelectzpe: -457.616999 hartree
zpe.sumelectthermal: -457.606931 hartree
zpe.sumelectthermalent: -457.605986 hartree
zpe.sumelectthermalfe: -457.652944 hartree
dipole: 0.2644 -2.0215 0.0008
dipole: 2.0387
quadrupole: -58.4558 -54.9484 -72.2342
quadrupole: -1.9704 0.0015 -0.0021
quadrupole: 3.4237 6.9311 -10.3547 -1.9704 0.0015 -0.0021
hfenergy: -457.7851151 hartree
pointgroup: C01 [X(C9H10N2)]
dipole: 0.0982373 0.7960575 -0.0007717 debye
dipolederiv: -2.0456759 -0.1833435 0.0003149 0.9258369 0.0545437 -0.0004532 -0.0007096 -0.0003201 -0.2971664 1.4918772 -0.0997537 -0.0000639 -1.0453407 -0.245768 0.0002214 0.0005702 0.0001294 -0.0991645 1.8034698 0.2808739 -0.0003923 0.6613657 0.0786876 0.0000073 -0.0007631 -0.0000029 0.1035786 -0.5681541 -0.1098127 0.0000977 0.1678344 0.066403 -0.0001399 -0.0000367 -0.000107 -0.2272667 -0.2576401 -0.0171341 0.0000216 -0.4525418 -0.0969265 0.0000188 0.000378 -0.0000492 -0.1925691 0.2510443 0.0461228 -0.000074 -0.0319146 0.146756 -0.0001258 -0.0001125 -0.000137 -0.1356227 0.1315062 -0.0425234 -0.0000306 0.1150884 0.1760266 -0.0001583 -0.0001096 -0.0001473 -0.1368949 -0.1643339 0.0577282 -0.0000376 -0.0426594 -0.1969156 -0.0000145 0.0000147 -0.0000228 -0.2092746 -0.7223668 0.1132789 -0.0000515 -0.0679098 0.3630848 -0.0004634 0.0002321 -0.0004801 -0.1372784 0.5793616 -0.0400925 0.0000026 -0.3755743 0.0985231 -0.0002128 0.000339 -0.0002206 -0.1276296 -0.5939064 -0.0081993 0.0000243 0.0311452 0.1185601 -0.0005891 -0.0000599 -0.0005837 -0.4573702 0.0705163 -0.087494 0.0000597 -0.0552489 -0.1129847 0.0001247 0.0000676 0.000131 0.1719841 0.0608792 0.0806335 -0.0000111 0.0944791 0.0473256 0.0000427 0.0000148 0.0000619 0.1741954 -0.0571663 0.1050757 -0.0000171 0.1334868 -0.014837 0.0000565 -0.0000174 0.0000669 0.1559622 0.0606591 -0.0409118 0.0000306 -0.0811046 -0.1199578 0.0001391 0.0000435 0.0001391 0.1523181 -0.1311781 -0.0620855 0.0000729 -0.0688429 0.0670871 0.0000586 0.0000911 0.0000657 0.1748503 -0.0002216 -0.0059933 0.0000312 0.0110748 -0.0223344 0.000318 0.0001073 0.0003364 0.3248844 -0.011684 0.0037939 0.0000112 -0.0024617 -0.2035337 0.0003854 0.0000012 0.0003606 0.1915184 0.07234 -0.0660755 0.0000698 0.0379592 -0.0820093 0.0002512 -0.0000319 0.0002529 0.1675607 -0.049033 0.0821312 -0.0000711 0.087783 0.001873 0.0001977 -0.0000669 0.0001948 0.1992545 0.0797064 -0.0062186 0.0000128 -0.0424548 -0.1236035 0.0003356 0.0000482 0.0003321 0.2041304 unknown
polarizability: 278.0251134|3.2694168|106.5090685|-0.0217637|-0.0405974|43.5297691 unknown
InChI: InChI=1S/C9H10N2/c1-2-8-10-11-9-6-4-3-5-7-9/h2-8,11H,1H2
charge 0 multiplicity 1
21 atoms
N  0.41689 0.804717 -0.000636
N  1.468617 -0.069074 0.000072
C  -0.917457 0.344602 -0.000136
C  -1.967779 1.301983 -0.000387
C  -1.222232 -1.04281 0.00059
C  -3.310665 0.872197 0.000024
C  -2.570369 -1.453952 0.00101
C  -3.623462 -0.507552 0.000711
C  2.69755 0.42792 -0.000539
C  3.841063 -0.468178 0.00034
C  5.143268 -0.04935 -0.000138
H  -1.734126 2.374761 -0.000861
H  -0.401827 -1.764539 0.000823
H  -4.113574 1.617985 -0.000184
H  -2.800812 -2.52556 0.001561
H  -4.667094 -0.838707 0.001019
H  0.579943 1.822703 -0.001632
H  2.894115 1.519795 -0.001589
H  3.603051 -1.53995 0.001438
H  5.972137 -0.763547 0.000546
H  5.406562 1.015856 -0.001233
