program: Gaussian 09
title: 000233351
version: EM64L-G09RevD.01
frameworkgroup: C1[X(C12H26N2O)]
method: RPBEPBE
basis: SDD
operation: Freq
keyword: #p
keyword: freq=noraman
keyword: PBEPBE/SDD
title: #p freq=noraman PBEPBE/SDD
converged: YES YES NO NO
title: Mulliken charges:
elementType: O N N C C C C C C C C C C C C H H H H H H H H H H H H H H H H H H H H H H H H H H
charge: -0.436265 -0.124946 -0.072674 -0.038534 0.312620 -0.425555 -0.384356 -0.416995 -0.715368 -0.333816 -0.750332 -0.715444 -0.711584 -0.399094 -0.314546 0.187144 0.186912 0.220300 0.167807 0.229255 0.221341 0.192164 0.228492 0.244814 0.187227 0.174645 0.202214 0.230433 0.211515 0.221676 0.214139 0.225458 0.204165 0.214044 0.213276 0.208582 0.201558 0.218397 0.179817 0.211267 0.330248
chargesum: 0.00000
title: Mulliken charges with hydrogens summed into heavy atoms:
elementType: O N N C C C C C C C C C C C C
charge: -0.106017 -0.124946 -0.072674 0.148611 0.312620 -0.018343 0.012706 -0.003490 -0.054835 0.043043 -0.086709 -0.071682 -0.075682 0.020861 0.076538
polarizability: 1.79497931e+02 -1.15455675e+00 1.35915234e+02 1.93549274e+00 -7.45637328e-01 1.27505565e+02
1716.lowfreq: -14.6541 -8.8862 0.0000 0.0006 0.0009 7.9869 21.3770 45.0671 65.2592
frequency: 20.2498 45.0396 65.2058 86.5978 88.6241 128.2047 152.6696 178.6766 179.5600 192.6609 215.2196 217.7733 240.1551 263.2786 271.9959 290.3145 309.5885 326.7117 339.7867 354.5336 362.1176 389.4569 403.8184 455.5317 469.1999 477.9553 494.7487 523.4856 629.8482 690.0729 763.0889 770.0854 778.1503 859.6470 871.8160 891.4505 898.7002 915.9033 934.0580 939.1790 948.6927 966.7320 991.6944 1012.2158 1019.5847 1042.7218 1052.4826 1058.3505 1072.1324 1083.9270 1097.1023 1121.3278 1140.1272 1145.0697 1154.4448 1199.0120 1201.8823 1220.6314 1235.8488 1242.8476 1254.8721 1271.5610 1276.7625 1281.3475 1301.4808 1313.5846 1328.7341 1333.2748 1344.1463 1359.6491 1364.0270 1372.0211 1374.8626 1378.2012 1382.8428 1393.4534 1397.0543 1454.5153 1459.0825 1460.9272 1462.4936 1466.8406 1471.4367 1473.0088 1477.1969 1479.2083 1479.7688 1483.1288 1488.8442 1499.0721 1503.0982 2820.2105 2828.7249 2845.6100 2944.0605 2958.1387 2972.1030 2973.9798 2979.1522 2980.0093 2983.9871 2984.6122 2997.9584 3004.3297 3012.6434 3032.5895 3044.0700 3066.4333 3068.5780 3071.2965 3074.5330 3075.5123 3081.8880 3084.2604 3089.0233 3104.0758 3559.3536
redmass: 3.8971 4.3458 1.8795 2.8447 2.8711 3.0837 2.2763 1.7172 1.6547 1.0754 2.8624 2.3536 1.0607 3.0446 1.9752 1.2787 2.2700 1.1820 2.4244 2.1148 2.3394 2.4901 2.3554 3.0387 2.9811 2.7584 2.8976 2.8768 3.5788 2.4066 3.1727 1.1253 2.8046 1.6509 1.6101 1.7174 1.7312 1.5910 1.7822 1.2527 3.1728 2.7703 1.9890 1.4051 1.4608 2.7738 2.7678 2.0906 2.0094 1.9594 1.7070 2.1043 1.5759 2.2284 3.0501 1.9413 2.2614 1.9484 1.7392 1.5494 1.8118 1.4922 1.2495 1.4169 1.2065 1.5983 1.2452 1.2672 1.3198 1.3185 1.3288 1.2452 1.2964 1.2458 1.2617 1.3135 1.2602 1.0540 1.0537 1.0508 1.0723 1.0585 1.0810 1.0541 1.0717 1.0731 1.0606 1.0735 1.0906 1.0552 1.0775 1.0706 1.0713 1.0716 1.0694 1.0609 1.0406 1.0614 1.0481 1.0394 1.0610 1.0375 1.0871 1.0860 1.1024 1.0861 1.0957 1.0994 1.0996 1.0990 1.0976 1.0965 1.0986 1.0995 1.0995 1.1004 1.0661
irintensity: 0.0954 1.1033 4.6388 0.7748 0.9226 3.5193 1.1324 0.9307 1.1680 0.0468 0.3188 0.2010 0.0778 5.7420 0.6419 1.1785 6.4327 158.6370 4.6050 7.1442 2.2045 1.0827 0.3823 7.9978 7.3264 1.9335 3.5534 2.2566 1.3175 4.5033 3.3654 5.8060 3.2309 4.4019 0.6298 3.0784 8.5761 2.3206 13.6752 1.3020 21.6298 95.0006 11.6294 0.9697 2.1936 6.7329 2.3289 34.5113 33.5795 5.3695 2.6512 7.5024 6.7417 35.4149 22.8094 41.9630 62.0497 17.7430 29.1742 19.4891 33.1012 10.0318 10.3123 16.2095 9.3356 5.7582 12.9634 15.6840 2.3095 10.2383 17.7899 27.8817 4.1135 32.4024 33.3378 22.5560 9.0775 3.4023 2.5787 0.0619 6.0813 4.1002 4.9961 1.7740 0.1054 10.4180 6.7320 12.0537 8.1901 17.5819 4.1006 67.0038 35.7352 197.9658 67.3726 48.6689 13.1453 54.5592 7.0084 49.3095 32.4167 24.1937 7.5385 69.4394 45.5474 37.6313 24.8268 16.0518 15.2198 57.1464 67.6493 10.9066 67.6703 44.1919 56.6988 28.6417 7.0974
temp: 298.150 k
press: 1.00000 atm
elementType: 8 7 7 6 6 6 6 6 6 6 6 6 6 6 6 1 1 1 1 1 1 1 1 1 1 1 1 1 1 1 1 1 1 1 1 1 1 1 1 1 1
symmnumber: 1
zpe: 966077.9 jmol-1
zpe.correction: 0.367960 hartree
zpe.thermalcorrener: 0.386219 hartree
zpe.thermalcorrenthalpy: 0.387163 hartree
zpe.thermalcorrgfe: 0.322076 hartree
zpe.sumelectzpe: -656.290423 hartree
zpe.sumelectthermal: -656.272164 hartree
zpe.sumelectthermalent: -656.271220 hartree
zpe.sumelectthermalfe: -656.336307 hartree
dipole: 1.8350 0.6337 1.3334
dipole: 2.3551
quadrupole: -108.8373 -94.8643 -95.6989
quadrupole: -10.4875 -0.1417 0.7375
quadrupole: -9.0372 4.9359 4.1013 -10.4875 -0.1417 0.7375
hfenergy: -656.658383 hartree
pointgroup: C01 [X(C12H26N2O1)]
dipole: -0.7390507 -0.4159189 0.3733167 debye
polarizability: 179.5636631|-1.0856372|134.2650776|-0.7001037|3.4361577|129.0899887 unknown
InChI: InChI=1S/C12H26N2O/c1-11-10-13(6-5-9-15)7-8-14(11)12(2,3)4/h11,15H,5-10H2,1-4H3
charge 0 multiplicity 1
41 atoms
O  6.108064 0.507254 -0.042499
N  -1.724229 0.204754 -0.345602
N  1.17289 -0.410052 -0.020899
C  -1.184731 -1.197765 -0.24069
C  -3.135865 0.410876 0.148461
C  0.115278 -1.238691 0.601337
C  -0.742776 1.238912 0.061282
C  0.655838 0.906391 -0.500667
C  -0.975016 -1.824564 -1.639565
C  2.416532 -0.346586 0.77237
C  -3.570868 1.871896 -0.144335
C  -4.088915 -0.52474 -0.641914
C  -3.282929 0.137668 1.680304
C  3.647843 0.031287 -0.08059
C  4.941498 0.084569 0.751451
H  -1.917978 -1.822884 0.308121
H  -0.125623 -0.913839 1.646996
H  0.473284 -2.284856 0.662267
H  -0.664217 1.36937 1.171923
H  -1.048484 2.215584 -0.353834
H  0.597809 0.914129 -1.608041
H  1.352287 1.714166 -0.199244
H  -1.899983 -1.741458 -2.234828
H  -0.165984 -1.303386 -2.178095
H  -0.699615 -2.894629 -1.557434
H  2.333883 0.370321 1.632698
H  2.581753 -1.348836 1.216357
H  -3.370348 2.126368 -1.20078
H  -4.655112 1.978899 0.039677
H  -3.052626 2.602592 0.50165
H  -3.851228 -1.59274 -0.492175
H  -4.023146 -0.305122 -1.722349
H  -5.131905 -0.367363 -0.310753
H  -2.600574 0.782244 2.265099
H  -4.315425 0.347596 2.016415
H  -3.059073 -0.916491 1.927923
H  3.74654 -0.712373 -0.897281
H  3.498749 1.017806 -0.559291
H  5.131133 -0.9000 1.233865
H  4.866387 0.847842 1.545269
H  6.211682 -0.115351 -0.8062
