program: Gaussian 09
title: 000233367
version: EM64L-G09RevD.01
frameworkgroup: C1[X(C18H25N3O4)]
method: RPBEPBE
basis: SDD
operation: Freq
keyword: #p
keyword: freq=noraman
keyword: PBEPBE/SDD
title: #p freq=noraman PBEPBE/SDD
converged: YES YES NO NO
title: Mulliken charges:
elementType: O O O O N N N C C C C C C C C C C C C C C C C C C H H H H H H H H H H H H H H H H H H H H H H H H H
charge: -0.456177 -0.456089 -0.271837 -0.264929 -0.131246 -0.438607 -0.078589 -0.375654 -0.363064 -0.347122 -0.537497 0.193284 -0.321565 -0.329212 0.391930 -0.243071 0.395458 0.336353 -0.529882 -0.590606 0.369040 -0.348526 -0.805935 -0.386644 -0.535686 0.252171 0.205481 0.220696 0.223864 0.222927 0.218603 0.245894 0.221310 0.198808 0.199778 0.193454 0.202776 0.350898 0.328320 0.262835 0.230239 0.239567 0.239711 0.230725 0.241675 0.345781 0.345887 0.242765 0.231204 0.230502
chargesum: 0.00000
title: Mulliken charges with hydrogens summed into heavy atoms:
elementType: O O O O N N N C C C C C C C C C C C C C C C C C C
charge: -0.110397 -0.110202 -0.271837 -0.264929 -0.131246 -0.087709 -0.078589 0.081998 0.081495 0.094408 -0.070293 0.193284 0.077021 0.067018 0.391930 -0.243071 0.395458 0.336353 -0.201562 -0.327770 0.369040 -0.118287 -0.095931 -0.144969 0.168785
polarizability: 3.23479864e+02 -1.95803712e+01 3.00494471e+02 6.55305247e+00 4.40153399e+00 1.33982395e+02
1716.lowfreq: -4.4886 -0.0006 0.0004 0.0007 3.5857 7.6756 14.1222 15.9853 26.2805
frequency: 13.6811 15.4001 26.2189 42.6262 54.2360 57.4716 62.1445 80.0231 81.4996 92.8071 100.9252 118.4263 148.8979 158.9059 161.5677 179.2613 190.5586 205.9829 218.0137 234.7347 238.6257 246.8351 253.2416 256.0868 271.3229 284.8745 298.3341 331.1775 332.6732 360.2607 383.5027 408.4172 453.2522 475.1407 487.4779 513.8531 522.5242 527.3374 550.5816 571.2170 599.7925 623.2031 652.0914 673.9054 704.9849 766.4493 794.5088 808.0430 810.1996 816.8973 843.5582 845.1286 855.1224 867.5315 869.0469 881.0755 916.0689 934.8100 952.0971 958.1564 969.9851 973.7679 995.7410 1005.5921 1010.4851 1018.6518 1041.6356 1044.1908 1045.9619 1072.2853 1082.8207 1090.6438 1111.9832 1119.2386 1135.8776 1151.1059 1162.0934 1182.2398 1202.5123 1205.2637 1207.9218 1210.6937 1221.4610 1230.3199 1246.0457 1255.1011 1280.4674 1292.6029 1295.1293 1299.3093 1312.5675 1330.4893 1349.1924 1352.7058 1371.7999 1375.8306 1398.6433 1405.1415 1409.7418 1415.2182 1427.2646 1447.7754 1449.5623 1458.9811 1465.6425 1468.6363 1470.3915 1471.4598 1473.4226 1475.4038 1478.3547 1480.2529 1485.4129 1489.1990 1529.0722 1562.4892 1588.6022 1599.3499 1628.8690 2884.4434 2917.9899 2924.0018 2945.0552 2949.9766 2971.9470 2976.9454 2988.2895 3003.1056 3004.4934 3043.3226 3049.7384 3053.0549 3056.6079 3064.3890 3065.4149 3094.3347 3127.5694 3128.7459 3153.3010 3172.2181 3193.5148 3369.0816 3577.5790 3578.6837
redmass: 5.3340 5.5089 5.5350 4.1572 4.4506 4.3881 4.4519 2.6034 3.3771 2.4499 3.6631 4.0238 3.2759 1.1960 3.6033 3.4240 3.2217 1.6150 2.7631 3.2503 2.5171 1.1407 1.1177 3.2678 3.3730 4.6287 3.4614 4.0339 3.9737 3.9686 4.4248 3.5495 4.0562 3.6581 3.7268 5.8137 4.9423 3.9411 4.3850 4.9449 4.2963 4.0401 4.4178 3.2997 5.5810 3.1769 1.5646 3.0561 1.1550 1.1782 1.3030 4.7549 3.6448 1.1762 1.7557 6.4091 1.4864 5.9220 1.4120 3.6295 6.5448 7.2192 2.3223 2.2761 2.4509 2.8576 2.2428 2.1779 1.5743 2.3671 1.7824 1.7599 1.2572 2.3300 1.5692 1.4491 1.5781 1.2574 1.6459 1.7891 1.3403 1.3588 1.8634 1.5293 2.0335 1.6438 1.1687 2.4879 1.2720 1.2758 1.6855 2.8558 1.3658 1.3373 1.4976 1.8498 1.5051 2.3054 1.4497 1.4672 2.5016 1.1785 1.8766 2.2887 1.0457 1.0547 1.0782 1.3732 1.0958 1.1668 2.1068 1.0953 1.0860 1.0839 3.1654 6.1272 6.0432 5.9918 6.3426 1.0712 1.0690 1.0692 1.0568 1.0555 1.0322 1.0378 1.0590 1.1034 1.1043 1.0954 1.0944 1.0969 1.0953 1.1044 1.0947 1.0986 1.0883 1.1007 1.0964 1.0913 1.0918 1.0768 1.0666 1.0666
irintensity: 0.4892 0.3807 0.5127 0.5514 1.2207 0.3737 1.1157 12.1982 6.6552 9.5974 7.9579 5.0914 2.2940 0.3011 6.3423 0.2936 4.8930 1.4231 14.1295 31.5647 3.8845 118.1385 162.9053 3.5684 1.2198 2.3923 6.1588 10.5851 6.8765 5.0026 5.3429 9.8572 3.0608 10.1137 0.6558 3.5212 7.2412 13.9740 16.0858 1.1612 9.2694 3.7993 0.8040 1.6130 6.6535 3.7476 4.8633 4.1560 4.0897 5.9165 34.1288 6.9753 21.3847 51.3555 29.5631 9.6845 53.9763 37.4436 0.1051 7.6806 153.5263 63.5727 33.0649 42.9603 23.2865 20.9093 9.5801 16.4781 7.3481 44.1231 6.4573 1.0809 0.1922 46.4006 19.6386 14.1164 39.3690 14.2558 12.3250 78.5520 68.1802 21.7967 31.5544 25.9670 18.0052 4.7914 6.0292 49.3347 7.1691 40.6236 24.4727 25.6528 3.0316 0.7077 13.1768 12.5080 13.0813 31.2753 1.7272 0.0380 173.8981 33.5262 42.6679 177.7495 14.8487 15.9975 4.7295 85.9496 4.6208 18.9717 92.7916 12.9817 6.6450 9.9205 610.4386 137.6536 38.7544 82.8389 165.0670 60.3818 21.6764 90.6619 67.3281 77.0555 62.4713 23.0241 11.2117 48.0923 51.0428 5.8527 17.6989 14.3386 83.6860 38.3716 33.4560 21.6869 11.8771 26.7969 36.0310 2.4467 8.4536 109.7184 3.6648 4.0941
temp: 298.150 k
press: 1.00000 atm
elementType: 8 8 8 8 7 7 7 6 6 6 6 6 6 6 6 6 6 6 6 6 6 6 6 6 6 1 1 1 1 1 1 1 1 1 1 1 1 1 1 1 1 1 1 1 1 1 1 1 1 1
symmnumber: 1
zpe: 1075497.8 jmol-1
zpe.correction: 0.409635 hartree
zpe.thermalcorrener: 0.436117 hartree
zpe.thermalcorrenthalpy: 0.437061 hartree
zpe.thermalcorrgfe: 0.349599 hartree
zpe.sumelectzpe: -1164.149339 hartree
zpe.sumelectthermal: -1164.122858 hartree
zpe.sumelectthermalent: -1164.121914 hartree
zpe.sumelectthermalfe: -1164.209375 hartree
dipole: 1.9078 -1.0060 -2.4186
dipole: 3.2406
quadrupole: -134.0492 -134.8862 -150.2043
quadrupole: -3.0029 17.4599 2.0670
quadrupole: 5.6641 4.8270 -10.4910 -3.0029 17.4599 2.0670
hfenergy: -1164.5589746 hartree
pointgroup: C01 [X(C18H25N3O4)]
dipole: -0.7783204 -0.448497 0.9047426 debye
polarizability: 324.6123387|17.912408|298.6499547|10.8200271|9.885185|134.694437 unknown
InChI: InChI=1S/C18H25N3O4/c1-13-3-5-19-18-15(13)11-14(25-2)12-16(18)20-17(24)4-6-21(7-9-22)8-10-23/h3,5,11-12,20,22-23H,4,6-10H2,1-2H3
charge 0 multiplicity 1
50 atoms
O  7.103599 2.434591 0.553579
O  5.748658 -3.789662 -0.504433
O  0.888404 1.873818 0.305244
O  -3.868362 3.327015 0.058382
N  4.596203 -0.248762 -0.163469
N  -0.306353 -0.135902 0.160346
N  -2.166388 -2.018896 -0.026515
C  3.284781 0.366841 -0.470169
C  5.742794 0.672977 -0.357315
C  4.798602 -1.592171 -0.756398
C  2.14369 -0.232231 0.384841
C  0.864426 0.6019 0.273907
C  5.96213 1.559279 0.876513
C  5.572786 -2.507913 0.201491
C  -1.63452 0.32908 0.090951
C  -2.630128 -0.714016 -0.008861
C  -4.027107 -0.357786 -0.083523
C  -4.982304 -1.442157 -0.183957
C  -2.014459 1.678045 0.113652
C  -4.396379 1.017611 -0.056538
C  -3.404042 2.006041 0.039995
C  -4.485619 -2.752257 -0.200746
C  -6.466485 -1.161229 -0.268118
C  -3.080272 -3.001806 -0.120408
C  -2.876706 4.405978 0.153457
H  3.33277 1.445309 -0.2400
H  3.024425 0.28285 -1.553474
H  5.617265 1.326294 -1.251281
H  6.661584 0.081662 -0.521645
H  5.339206 -1.552802 -1.729793
H  3.817228 -2.057914 -0.957264
H  2.478409 -0.212908 1.440322
H  1.955413 -1.290034 0.121152
H  6.177718 0.917911 1.756008
H  5.051169 2.157484 1.090538
H  6.555766 -2.055456 0.45423
H  4.991844 -2.634036 1.138302
H  -0.270355 -1.168271 0.12702
H  -1.233493 2.436226 0.186854
H  -5.44222 1.330207 -0.110504
H  -5.172652 -3.601721 -0.275978
H  -6.821662 -0.611077 0.623864
H  -6.70651 -0.535204 -1.14833
H  -7.044551 -2.096805 -0.345416
H  -2.698641 -4.028903 -0.134147
H  7.264347 3.057559 1.305305
H  6.254046 -4.416771 0.070326
H  -3.467654 5.333464 0.148028
H  -2.186658 4.394998 -0.71105
H  -2.29524 4.336547 1.092023
