program: Gaussian 09
title: 000233389
version: EM64L-G09RevD.01
frameworkgroup: C1[X(C18H18O6)]
method: RPBEPBE
basis: SDD
operation: Freq
keyword: #pfreq=noraman
keyword: PBEPBE/SDD
title: #p freq=noraman PBEPBE/SDD
converged: YES YES NO NO
title: Mulliken charges:
elementType: O O O O O O C C C C C C C C C C C C C C C C C C H H H H H H H H H H H H H H H H H H
charge: -0.300437 -0.247927 -0.395138 -0.259071 -0.336128 -0.226091 0.034398 -0.606781 0.270929 0.256070 0.161413 0.202541 0.211763 -0.547158 0.380814 -0.548991 0.197249 -0.332323 -0.357795 -0.295235 -0.206009 -0.536455 -0.537131 -0.524732 0.252788 0.269062 0.253608 0.281189 0.230110 0.258152 0.235383 0.234604 0.377772 0.237391 0.221250 0.261892 0.224546 0.253187 0.221632 0.214356 0.282927 0.232376
chargesum: 0.00000
title: Mulliken charges with hydrogens summed into heavy atoms:
elementType: O O O O O O C C C C C C C C C C C C C C C C C C
charge: -0.300437 -0.247927 -0.017365 -0.259071 -0.336128 -0.226091 0.034398 -0.084930 0.270929 0.256070 0.161413 0.202541 0.211763 -0.293550 0.380814 -0.267803 0.197249 -0.102213 -0.099643 -0.059852 0.028595 0.184079 0.162235 0.204927
polarizability: 2.92855696e+02 9.95380810e+00 2.40300078e+02 1.44575799e+01 7.82708147e+00 1.56607699e+02
1716.lowfreq: -11.1773 -7.1561 -0.0010 -0.0009 -0.0008 3.1523 14.8183 19.2358 33.9697
frequency: 14.3848 18.8180 33.7137 51.9119 67.1770 84.6839 105.9305 115.7169 126.2728 140.7976 162.7253 171.6711 183.9145 207.6036 216.0246 226.2304 235.8362 242.2827 256.7745 271.1012 294.3271 303.7366 313.2949 331.7288 377.8476 379.5374 406.9768 440.9688 459.5896 466.5099 509.6594 516.7262 532.7511 562.5041 564.0251 572.6590 585.0313 600.9545 632.5304 645.6328 671.2523 703.8963 725.6733 744.4395 758.3000 770.3966 795.8059 828.1001 856.6586 864.9322 898.5711 914.3731 935.4018 948.0780 969.1348 979.8030 985.2128 1010.0782 1015.6365 1039.9066 1047.7057 1081.1718 1108.2684 1110.0557 1113.0810 1115.0727 1145.0903 1151.6365 1160.9518 1161.7214 1167.3968 1181.6814 1204.7538 1215.4334 1229.6391 1270.2082 1273.9702 1293.4519 1316.1915 1371.4374 1377.6376 1405.1002 1406.9631 1414.0649 1421.5867 1434.0583 1440.2581 1445.0942 1451.1293 1463.3793 1468.9142 1469.3309 1471.8385 1472.4663 1473.1137 1478.6579 1548.0244 1552.9779 1583.0622 1585.0457 1608.7255 1648.8644 2556.8491 2965.1598 2969.9100 2978.9555 3006.3084 3056.5976 3065.5095 3089.1445 3089.8848 3125.1151 3126.4848 3130.4001 3135.1924 3148.0367 3163.5960 3175.2527 3192.0988 3199.1114
redmass: 5.3611 5.4938 4.8200 4.6527 4.0628 4.1649 4.1474 4.5694 4.0568 7.7686 5.4827 3.3027 1.8420 1.8876 3.8074 1.8205 2.0524 3.7721 2.8520 1.6737 2.4915 3.0451 4.8880 4.4864 4.4986 5.2864 4.7780 5.0440 4.9327 4.6755 4.9110 4.4557 4.7426 5.8302 6.4472 6.2863 3.8478 3.6403 4.1722 3.6553 4.7311 4.4218 3.1496 3.6706 1.7276 2.4997 1.9427 4.9224 1.8820 1.4954 7.3810 3.5924 6.4645 1.3931 5.8138 5.1085 1.3588 1.0704 3.8532 2.1930 3.2281 6.8498 1.3581 1.2567 1.2564 1.5772 1.6237 1.3141 1.7248 1.2202 1.4623 1.2496 2.5060 1.5543 2.8325 2.7348 1.7494 1.8085 4.5267 4.7993 6.5732 1.6248 2.5849 1.6431 2.2165 1.2938 1.5694 1.3833 1.0759 1.6244 1.0567 1.5756 1.1233 1.1065 1.0831 1.7578 4.6186 6.0412 2.8612 7.8019 6.1634 4.4712 1.0764 1.0328 1.0321 1.0329 1.0635 1.1043 1.1043 1.0941 1.0990 1.1053 1.1008 1.0996 1.0853 1.0895 1.0946 1.0997 1.0896 1.0930
irintensity: 0.3116 2.1548 1.1817 2.1847 0.3093 1.8721 4.4146 0.6790 6.4736 2.7579 0.3588 0.0341 2.0168 1.5483 1.9160 0.4409 1.0339 0.9330 1.2055 0.6786 3.7570 17.0214 0.2521 5.7962 3.2986 2.4215 12.1045 3.8089 6.3972 2.3629 24.2463 20.8984 5.6303 5.2722 3.8678 3.1885 6.6694 0.4883 22.7864 29.5053 23.4752 5.7251 4.0987 9.7433 44.4461 52.1635 10.4907 4.1046 57.2422 3.8450 9.2349 8.0982 7.6620 1.6355 16.2177 53.8132 1.9643 115.5606 43.1807 6.1367 25.6892 105.9687 6.1564 0.2759 0.1461 27.9051 65.3258 7.0128 165.4608 26.4443 23.0967 32.5202 166.2515 110.7837 132.1695 26.5713 98.4363 146.0947 204.1980 102.3661 8.6750 131.4567 73.9467 34.1370 121.4289 18.8229 18.2363 4.4216 21.8435 13.2412 12.8000 31.3853 85.4614 3.4838 39.9872 103.3532 228.5904 75.5539 165.7538 130.1445 59.0272 635.4949 411.4438 47.6583 60.5239 41.6965 10.6897 41.5133 30.0003 5.2224 23.0992 23.4234 12.4808 21.1533 0.7218 16.5421 19.8922 12.9852 3.1644 0.3318
temp: 298.150 k
press: 1.00000 atm
elementType: 8 8 8 8 8 8 6 6 6 6 6 6 6 6 6 6 6 6 6 6 6 6 6 6 1 1 1 1 1 1 1 1 1 1 1 1 1 1 1 1 1 1
symmnumber: 1
zpe: 845514.8 jmol-1
zpe.correction: 0.322040 hartree
zpe.thermalcorrener: 0.345030 hartree
zpe.thermalcorrenthalpy: 0.345974 hartree
zpe.thermalcorrgfe: 0.268150 hartree
zpe.sumelectzpe: -1146.266033 hartree
zpe.sumelectthermal: -1146.243043 hartree
zpe.sumelectthermalent: -1146.242099 hartree
zpe.sumelectthermalfe: -1146.319922 hartree
dipole: -1.8905 -7.3344 -1.0951
dipole: 7.6529
quadrupole: -133.5677 -129.1046 -141.5287
quadrupole: -19.6691 6.9368 3.3217
quadrupole: 1.1660 5.6291 -6.7950 -19.6691 6.9368 3.3217
hfenergy: -1146.5880726 hartree
pointgroup: C01 [X(C18H18O6)]
dipole: -0.4928969 -0.4979856 -2.9282206 debye
polarizability: 291.4546728|-3.5856811|158.7806696|16.7878858|18.0700118|239.52813 unknown
InChI: InChI=1S/C18H18O6/c1-22-11-8-14(20)18(17(9-11)24-3)15(21)10-13(19)12-6-4-5-7-16(12)23-2/h4-9,20H,10H2,1-3H3
charge 0 multiplicity 1
42 atoms
O  0.774988 0.28675 -1.048486
O  5.509291 -0.768523 -0.181969
O  2.982899 1.527546 3.109827
O  -3.950453 -1.642234 1.271828
O  0.589149 2.040526 2.774317
O  -0.966312 -0.850444 1.374579
C  1.800669 0.919914 1.043557
C  -0.753875 1.525944 0.860006
C  0.577325 1.496148 1.591622
C  1.921221 0.289715 -0.245086
C  -1.424412 0.144538 0.740417
C  -2.642501 0.027959 -0.125993
C  3.002741 0.949204 1.870005
C  3.128461 -0.28231 -0.685718
C  4.269621 -0.229678 0.16556
C  4.213911 0.382944 1.428887
C  -3.70359 -0.912756 0.113011
C  -2.683134 0.764669 -1.351529
C  -4.677867 -1.152184 -0.895887
C  -3.6625 0.542465 -2.332264
C  -4.656983 -0.443933 -2.106727
C  0.781182 -0.506755 -2.282805
C  5.642099 -1.439388 -1.479252
C  -3.4738 -1.213511 2.596191
H  -0.627643 1.977146 -0.136376
H  -1.427716 2.180331 1.446387
H  3.192123 -0.752491 -1.667835
H  5.094489 0.415977 2.072365
H  -1.895045 1.496584 -1.552725
H  -5.458872 -1.886015 -0.675037
H  -3.65034 1.11761 -3.263569
H  -5.42403 -0.640648 -2.863662
H  2.000995 1.870018 3.263726
H  1.032681 -1.562308 -2.070606
H  1.487057 -0.08582 -3.024073
H  -0.248001 -0.440624 -2.664868
H  4.9589 -2.306888 -1.554487
H  6.684921 -1.785978 -1.513002
H  5.456288 -0.738027 -2.315257
H  -3.496409 -0.110533 2.686093
H  -2.448765 -1.575449 2.772139
H  -4.184865 -1.664785 3.305194
