program: Gaussian 09
title: 000233300
version: EM64L-G09RevD.01
frameworkgroup: C1[X(C5H2Cl4N2)]
method: RPBEPBE
basis: SDD
operation: Freq
keyword: #p
keyword: freq=noraman
keyword: PBEPBE/SDD
title: #p freq=noraman PBEPBE/SDD
converged: NO NO NO NO
title: Mulliken charges:
elementType: Cl Cl Cl Cl N N C C C C C H H
charge: -0.027307 0.070748 0.056016 0.056017 0.077629 0.077631 0.098097 -0.686379 0.018843 -0.161694 -0.161693 0.291046 0.291046
chargesum: 0.00000
title: Mulliken charges with hydrogens summed into heavy atoms:
elementType: Cl Cl Cl Cl N N C C C C C
charge: -0.027307 0.070748 0.056016 0.056017 0.077629 0.077631 0.098097 -0.104287 0.018843 -0.161694 -0.161693
polarizability: 1.48428906e+02 -1.40174571e-04 1.21891634e+02 -5.34588565e+00 -1.97412573e-04 5.51014390e+01
1716.lowfreq: -0.7660 -0.0016 0.0007 0.0034 2.9368 5.9110 36.8763 49.8913 85.1094
frequency: 36.8743 49.8779 85.1050 189.4516 190.6487 196.0224 210.6164 244.4434 327.1319 340.6917 405.7992 442.3953 505.5435 575.2229 586.1847 659.6727 691.8839 756.5561 794.6729 886.6700 921.3645 981.6660 1119.2802 1243.5931 1255.4198 1269.7917 1276.9622 1365.0434 1437.8328 1441.6478 1496.9028 3093.2452 3186.5875
redmass: 11.1538 28.3083 23.3641 21.4798 27.6463 14.4925 17.4822 2.9660 21.4740 15.5193 10.9420 11.0401 5.8496 12.4037 10.7241 9.1694 9.0640 10.9290 10.2145 8.3553 1.6842 12.3522 1.3275 8.7548 8.8387 1.1888 3.9069 5.9422 1.2105 9.6015 12.6259 1.0562 1.1129
irintensity: 1.2068 0.3891 0.7935 0.1574 0.1602 0.0047 0.8540 4.8470 0.1324 0.2607 4.6854 34.6333 3.3847 0.0435 16.6682 22.6367 10.5960 107.6616 2.0229 2.9236 9.8055 35.2043 1.7239 166.6586 81.4678 16.8306 32.3376 38.7698 17.3123 288.6757 90.6147 7.3723 0.2190
temp: 298.150 k
press: 1.00000 atm
elementType: 17 17 17 17 7 7 6 6 6 6 6 1 1
symmnumber: 1
zpe: 169061.1 jmol-1
zpe.correction: 0.064392 hartree
zpe.thermalcorrener: 0.075005 hartree
zpe.thermalcorrenthalpy: 0.075949 hartree
zpe.thermalcorrgfe: 0.025206 hartree
zpe.sumelectzpe: -2140.656075 hartree
zpe.sumelectthermal: -2140.645462 hartree
zpe.sumelectthermalent: -2140.644518 hartree
zpe.sumelectthermalfe: -2140.695261 hartree
dipole: 0.8003 0.0000 1.6167
dipole: 1.8040
quadrupole: -92.1158 -95.6645 -87.5790
quadrupole: 0.0002 -5.8527 -0.0001
quadrupole: -0.3294 -3.8781 4.2074 0.0002 -5.8527 -0.0001
hfenergy: -2140.7204668 hartree
pointgroup: C01 [X(C5H2Cl4N2)]
dipole: -0.2916543 0.0000123 0.6470432 debye
dipolederiv: -0.5099524 -0.0000288 0.0862865 -0.0000176 -0.1251153 -0.0000034 0.2877604 0.0000151 -0.3185208 -0.7715405 -0.0000752 -0.1113529 -0.0000765 0.0127565 -0.0000104 -0.1408583 -0.0000132 0.0075887 -0.2078007 0.3246309 -0.0185204 0.3368738 -0.6985208 0.0351487 -0.0279766 0.0471962 -0.0294073 -0.2076792 -0.3245412 -0.0184912 -0.3367861 -0.6986482 -0.0351048 -0.027943 -0.0471526 -0.0294014 -0.9073199 0.3657274 -0.0722003 0.0901229 -0.552393 -0.0296283 -0.1238686 0.0553398 -0.1354105 -0.9072375 -0.3657981 -0.0721812 -0.0902017 -0.5524767 0.0296441 -0.1238592 -0.0553324 -0.1354075 0.9026831 0.0000311 -0.0029254 0.0000313 0.5319685 -0.0000237 -0.0472311 -0.000027 -0.0405331 0.4303489 0.0000191 -0.1444135 0.0000202 0.1259167 0.000006 -0.2011924 0.0000004 0.4467703 0.9884006 0.000176 0.1582421 0.0001782 -0.8700875 0.0000468 0.1756777 0.0000481 0.0578906 0.5520657 -0.4679457 0.0568881 -0.4923436 1.3885877 -0.0272267 0.0732831 -0.0702391 0.0820525 0.5518909 0.467795 0.0568499 0.4921933 1.3887715 0.0271457 0.073238 0.0701601 0.0820444 0.0430641 0.0012989 0.0409013 0.049814 0.0246324 0.076104 0.0414788 0.0484829 0.0061599 0.043077 -0.0012894 0.0409169 -0.0498081 0.0246083 -0.076098 0.0414912 -0.0484783 0.0061742 unknown
polarizability: 148.6933333|0.0021008|121.8916341|1.9570845|-0.0018623|54.8370111 unknown
InChI: InChI=1S/C5H2Cl4N2/c6-1-2-10-4(8)3(7)5(9)11-2/h1H2
charge 0 multiplicity 1
13 atoms
Cl 3.627745 0.000266 -1.058999
Cl -3.196548 -0.000294 -0.402975
Cl -1.511307 2.799954 -0.073199
Cl -1.510789 -2.800211 -0.073003
N  0.631635 1.206769 0.290494
N  0.631858 -1.206604 0.290578
C  1.264064 0.000145 0.39453
C  2.746273 0.00029 0.616543
C  -1.437685 -0.000122 -0.082727
C  -0.690285 1.199594 0.057393
C  -0.690063 -1.19969 0.057474
H  3.076833 -0.91466 1.123001
H  3.076667 0.915362 1.122889
