program: Gaussian 09
title: 000233313
version: EM64L-G09RevD.01
frameworkgroup: C1[X(C12H11N5)]
method: RPBEPBE
basis: SDD
operation: Freq
keyword: #pfreq=noraman
keyword: PBEPBE/SDD
title: #p freq=noraman PBEPBE/SDD
converged: YES YES NO NO
title: Mulliken charges:
elementType: N N N N N C C C C C C C C C C C C H H H H H H H H H H H
charge: -0.152859 -0.278799 -0.045112 -0.093798 -0.010376 -0.510084 0.437260 0.233681 0.051929 -0.443643 -0.364347 -0.237776 -0.343862 -0.215883 -0.225691 -0.238959 -0.362567 0.229862 0.286467 0.331904 0.238374 0.259853 0.245915 0.264920 0.231441 0.232535 0.233992 0.245622
chargesum: 0.00000
title: Mulliken charges with hydrogens summed into heavy atoms:
elementType: N N N N N C C C C C C C C C C C C
charge: -0.152859 0.053105 -0.045112 -0.093798 -0.010376 0.006245 0.437260 0.233681 0.051929 -0.205269 -0.104494 0.008139 -0.078942 0.015558 0.006844 -0.004967 -0.116944
polarizability: 2.39132670e+02 2.53294344e+01 1.38340345e+02 -8.38800322e+00 -1.51298984e+00 1.12637590e+02
1716.lowfreq: -15.5335 -9.1866 -0.0008 -0.0007 -0.0002 3.2397 16.8826 28.2228 40.0234
frequency: 16.6638 28.1638 40.0054 89.0594 127.6169 177.0484 206.3126 225.1772 275.2667 333.6819 383.6923 403.4140 432.5951 445.5580 457.6161 519.6603 522.7168 537.8102 569.3374 607.4671 614.1815 616.5624 699.1835 711.6093 753.4490 769.8269 794.4696 816.2235 846.7520 859.6103 880.9024 904.6052 913.8415 936.0805 944.0504 983.0855 990.0686 1000.8909 1024.3514 1036.4719 1044.2520 1085.7410 1096.7891 1148.3113 1173.6225 1176.8371 1185.8271 1214.3012 1227.0772 1242.3136 1301.1558 1310.6450 1333.7879 1350.0585 1359.6260 1382.2671 1387.1173 1408.6207 1439.1809 1455.0126 1463.7864 1484.0898 1504.5825 1532.2369 1594.3011 1598.3937 1614.5089 2956.9353 3049.9384 3119.1079 3127.3660 3135.5154 3138.7698 3149.9875 3161.2409 3165.8981 3166.4881 3477.0055
redmass: 4.5099 4.6283 5.7333 4.5933 6.4188 5.0969 4.5285 4.6617 5.5929 2.2718 3.5258 2.8215 4.1365 3.6494 2.9076 3.0339 3.2552 4.7027 5.0423 5.4232 5.8629 6.5549 3.8872 2.1135 1.9503 5.1598 4.2730 5.8631 4.5938 1.2477 1.4989 1.5375 1.4511 1.4928 1.9986 1.3889 6.1532 1.3277 2.3341 2.5472 5.1674 1.6448 4.1559 3.4583 1.0574 3.0456 1.1169 2.8384 1.2836 3.9158 3.3827 1.4954 1.8387 1.7344 1.3996 2.2843 2.4126 2.0118 1.9365 1.2436 2.2600 2.2257 6.0618 5.8248 6.2245 6.2276 6.0200 1.0658 1.0945 1.0877 1.0864 1.0923 1.0912 1.0961 1.0902 1.0952 1.1014 1.0787
irintensity: 0.3179 0.7704 1.9022 2.1483 1.5944 8.9387 8.5782 2.0263 8.0410 5.8447 5.0633 0.2707 27.9025 64.2397 50.9287 51.1868 17.3803 33.1821 11.5729 16.5670 10.8568 1.7486 14.8800 43.7087 42.4715 15.7574 14.1059 7.6068 7.2011 0.0438 0.0892 30.4638 14.9682 0.5304 15.0824 0.4354 0.8606 0.5670 13.2990 5.9959 24.9685 11.5086 7.8995 32.5875 0.1987 5.0863 5.2392 6.6009 54.3546 40.9249 50.7650 4.4761 37.3407 29.2855 0.7765 70.6548 2.2787 173.5685 16.5063 25.8755 39.7144 13.9510 13.5709 20.7931 56.8740 306.9596 2.4876 51.1317 13.9891 7.2431 0.8989 11.4763 9.6065 32.7545 25.6309 6.5782 21.1507 51.3959
temp: 298.150 k
press: 1.00000 atm
elementType: 7 7 7 7 7 6 6 6 6 6 6 6 6 6 6 6 6 1 1 1 1 1 1 1 1 1 1 1
symmnumber: 1
zpe: 563786.7 jmol-1
zpe.correction: 0.214735 hartree
zpe.thermalcorrener: 0.228278 hartree
zpe.thermalcorrenthalpy: 0.229222 hartree
zpe.thermalcorrgfe: 0.171875 hartree
zpe.sumelectzpe: -736.390318 hartree
zpe.sumelectthermal: -736.376775 hartree
zpe.sumelectthermalent: -736.375831 hartree
zpe.sumelectthermalfe: -736.433178 hartree
dipole: 6.1868 2.0105 -0.4667
dipole: 6.5220
quadrupole: -109.0502 -99.8686 -94.1425
quadrupole: 1.7517 1.7867 -0.1939
quadrupole: -8.0298 1.1518 6.8780 1.7517 1.7867 -0.1939
hfenergy: -736.6050528 hartree
pointgroup: C01 [X(C12H11N5)]
dipole: 2.3396133 0.9774927 0.3933779 debye
polarizability: 232.880597|34.0773909|137.8579009|11.7280742|13.278962|119.3721064 unknown
InChI: InChI=1S/C12H11N5/c1-2-4-10(5-3-1)7-17-12-11(14-9-16-17)6-13-8-15-12/h1-6,8-9,16H,7H2
charge 0 multiplicity 1
28 atoms
N  -0.362317 0.307184 -0.176575
N  -0.337861 1.529284 0.603527
N  -2.69909 1.422336 1.119738
N  -1.685104 -1.379882 -1.182258
N  -4.082382 -1.538366 -0.741692
C  0.736394 0.184109 -1.152327
C  2.099294 0.097733 -0.472968
C  -1.612548 -0.292905 -0.371525
C  -2.769385 0.251526 0.292178
C  3.186012 0.875864 -0.941761
C  2.303163 -0.784512 0.619939
C  -1.501527 1.949623 1.245459
C  -3.978832 -0.419554 0.069304
C  4.460418 0.767708 -0.338285
C  3.573252 -0.888889 1.22752
C  4.656969 -0.114557 0.748434
C  -2.931198 -1.948323 -1.32247
H  0.713942 1.042226 -1.856704
H  0.5069 -0.736641 -1.718505
H  0.573708 1.679571 1.050028
H  3.036268 1.564793 -1.782526
H  1.462685 -1.386988 0.98444
H  -1.361401 2.829474 1.884538
H  -4.898045 -0.053718 0.536445
H  5.294411 1.371951 -0.712052
H  3.721179 -1.575824 2.068221
H  5.643228 -0.198144 1.218115
H  -2.985236 -2.822082 -1.978738
