program: Gaussian 09
title: 000233343
version: EM64L-G09RevD.01
frameworkgroup: C1[X(C15H23ClN2S)]
method: RPBEPBE
basis: SDD
operation: Freq
keyword: #p
keyword: freq=noraman
keyword: PBEPBE/SDD
title: #p freq=noraman PBEPBE/SDD
converged: YES YES NO NO
title: Mulliken charges:
elementType: Cl S N N C C C C C C C C C C C C C C C H H H H H H H H H H H H H H H H H H H H H H H
charge: -0.083268 0.153267 -0.049360 -0.183458 -0.359079 -0.365684 -0.395769 -0.372007 -0.645933 0.496325 -0.675169 -0.315387 -0.395036 -0.289405 -0.339091 -0.098442 -0.204731 -0.294300 -0.688151 0.196411 0.237514 0.209915 0.198310 0.215951 0.222674 0.208158 0.217359 0.242691 0.249591 0.264277 0.245854 0.261757 0.221564 0.193910 0.209777 0.195601 0.193589 0.225647 0.255754 0.217770 0.212765 0.207842
chargesum: 0.00000
title: Mulliken charges with hydrogens summed into heavy atoms:
elementType: Cl S N N C C C C C C C C C C C C C C C
charge: -0.083268 0.153267 -0.049360 -0.183458 0.074846 0.042541 0.042855 0.053510 -0.153651 0.496325 -0.165038 -0.053631 -0.173473 0.114282 0.050099 -0.098442 0.020917 -0.038546 -0.049775
polarizability: 2.78620742e+02 1.03995727e+01 1.72949613e+02 7.45765827e+00 -2.06046231e+01 1.76985033e+02
1716.lowfreq: -13.8376 -8.3258 0.0015 0.0016 0.0028 2.6914 7.6459 18.7627 29.7149
frequency: -2.5547 18.7364 29.6803 52.8268 54.5230 61.8925 76.8909 110.8986 123.9097 155.2379 166.4936 179.2971 197.1159 213.1042 231.2259 261.4012 271.6762 287.2106 320.3052 329.2748 361.4660 380.7480 381.9253 388.1327 437.1171 463.3161 470.6342 514.1019 568.4025 616.9101 661.3385 672.2280 679.0766 691.1946 723.3194 751.3228 761.1398 767.0257 771.4457 835.0294 848.3710 860.7663 882.4084 890.0349 915.5868 934.6897 958.2303 969.8675 977.3922 1002.2374 1023.3660 1049.7307 1060.8747 1068.8680 1073.9900 1076.4763 1086.6527 1094.3303 1098.6243 1140.4833 1148.8296 1168.7881 1182.4538 1203.2754 1205.3326 1225.0300 1234.2104 1244.2411 1269.9768 1273.9020 1285.8311 1293.4039 1295.3117 1302.1413 1308.1505 1340.6892 1341.8453 1348.8791 1357.4171 1370.5433 1380.3907 1385.4460 1389.1502 1434.3569 1444.5542 1447.4239 1455.1282 1459.7975 1463.4016 1465.8926 1470.8699 1474.6063 1476.6205 1484.8019 1486.3171 1558.3303 1615.2035 2871.7844 2878.8722 2918.0275 2922.7408 2925.5613 2966.4469 2973.4634 2977.0878 3004.0214 3009.0421 3034.8124 3037.6038 3045.3976 3060.5482 3062.2825 3069.8362 3074.0139 3082.4887 3095.1338 3136.1244 3162.1609 3181.6386 3184.4498
redmass: 4.7684 4.9743 4.4712 2.0938 2.9558 3.3930 3.6672 2.6357 4.1578 3.1241 4.5066 5.1438 3.1870 2.7626 1.1964 2.2079 3.3226 2.8892 4.5846 3.1417 4.5171 3.4918 3.9561 2.4865 3.0575 3.5351 3.0598 4.6268 4.4742 2.8358 5.2189 4.2878 2.0586 6.0572 1.0841 4.4419 1.8109 1.3020 2.0768 1.6210 1.5613 1.4232 1.4497 1.7527 1.4052 3.7431 1.3623 4.9109 1.9002 2.5739 3.9112 1.7792 1.9487 2.4021 1.3544 2.2106 2.0256 1.7178 2.1732 2.4209 2.4272 2.3977 1.0989 1.1055 1.4665 1.2235 1.4662 1.5311 1.1880 1.1841 1.0870 1.3277 1.3127 1.4032 1.4730 1.5333 1.3529 1.6422 1.6746 1.6869 2.0609 1.7631 1.2116 3.2589 1.0837 1.0939 1.1021 1.0866 1.0999 1.0919 1.1057 1.0678 1.0428 2.5856 1.0780 6.3907 6.7641 1.0705 1.0695 1.0690 1.0694 1.0684 1.0580 1.0384 1.0592 1.0623 1.0953 1.0905 1.1022 1.0903 1.0948 1.0914 1.1010 1.0995 1.1053 1.0894 1.0868 1.0933 1.0937 1.0944
irintensity: 0.3295 0.1185 0.3033 0.2477 1.0585 0.3662 0.5230 0.5886 2.0120 7.5865 3.1800 2.4372 2.2565 2.0136 0.2493 3.0313 1.8476 6.5833 2.4480 5.5042 8.7412 3.7317 1.9798 2.1635 3.5111 2.7050 1.9991 0.2092 1.1684 10.7294 6.9039 17.1591 27.4304 25.3532 14.1086 15.0286 68.3644 10.5990 8.5463 20.0548 15.5289 0.1595 6.8138 4.4434 6.0980 96.0278 0.6630 25.0330 4.4046 103.8696 2.9713 3.4208 6.1852 1.6047 6.8556 16.5963 0.7712 13.3110 11.2010 60.3816 94.1385 13.0520 2.5559 4.8330 3.6805 3.2644 62.5735 75.1573 25.5080 1.0837 5.6871 6.3261 2.1815 39.3268 20.7877 1.7246 4.3339 0.4679 6.1674 27.0171 7.6922 34.2909 10.2899 4.3558 3.4093 4.3837 17.3927 12.1692 44.8230 33.5322 4.4663 5.1555 12.5720 139.5938 18.1897 89.6613 278.0824 51.9284 95.7028 35.9008 56.6935 157.6855 17.4863 27.2991 47.5913 24.2307 7.9924 45.3681 22.8574 12.5445 19.5365 25.0908 61.1969 47.9831 35.8512 20.3478 13.0405 18.6539 6.3024 1.0470
temp: 298.150 k
press: 1.00000 atm
elementType: 17 16 7 7 6 6 6 6 6 6 6 6 6 6 6 6 6 6 6 1 1 1 1 1 1 1 1 1 1 1 1 1 1 1 1 1 1 1 1 1 1 1
symmnumber: 1
zpe: 927205.4 jmol-1
zpe.correction: 0.353154 hartree
zpe.thermalcorrener: 0.372825 hartree
zpe.thermalcorrenthalpy: 0.373769 hartree
zpe.thermalcorrgfe: 0.302771 hartree
zpe.sumelectzpe: -1551.527021 hartree
zpe.sumelectthermal: -1551.507351 hartree
zpe.sumelectthermalent: -1551.506407 hartree
zpe.sumelectthermalfe: -1551.577404 hartree
dipole: -2.5051 2.1843 -2.2422
dipole: 4.0092
quadrupole: -148.5617 -131.4032 -126.7957
quadrupole: -2.9824 -7.3973 -3.3585
quadrupole: -12.9749 4.1837 8.7912 -2.9824 -7.3973 -3.3585
hfenergy: -1551.8801752 hartree
pointgroup: C01 [X(C15H23Cl1N2S1)]
dipole: -0.9112559 0.8077948 -1.0025695 debye
polarizability: 276.2067748|13.9710597|171.5604557|16.0378034|-19.0930801|180.7881578 unknown
InChI: InChI=1S/C15H23ClN2S/c1-2-3-11-19-13-17-7-9-18(10-8-17)15-6-4-5-14(16)12-15/h4-6,12H,2-3,7-11,13H2,1H3
charge 0 multiplicity 1
42 atoms
Cl 5.470359 -0.489509 2.705729
S  -3.882936 -2.162876 0.008142
N  -1.510051 -0.904912 -0.834075
N  1.231292 -0.139908 -0.377556
C  -0.529299 -1.890446 -0.332694
C  -0.860705 0.097078 -1.710677
C  0.602742 -1.195561 0.444178
C  0.248682 0.821988 -0.930086
C  -2.738282 -1.490899 -1.361221
C  2.554502 0.276406 -0.106032
C  -4.178801 -0.544596 0.949405
C  3.268873 -0.220386 1.028472
C  3.238032 1.182228 -0.977649
C  -5.268572 0.343023 0.325075
C  -5.482149 1.656188 1.118023
C  4.601142 0.173529 1.234689
C  4.569397 1.560737 -0.726721
C  5.287255 1.059341 0.386843
C  -6.580115 2.548127 0.498265
H  -0.08412 -2.476446 -1.175026
H  -1.057106 -2.591833 0.338379
H  -1.61744 0.835272 -2.035579
H  -0.41669 -0.374037 -2.622351
H  0.194654 -0.778206 1.393232
H  1.359798 -1.957325 0.696506
H  0.752696 1.536863 -1.597708
H  -0.222627 1.399957 -0.102589
H  -2.583454 -2.379846 -2.013142
H  -3.291508 -0.725437 -1.931006
H  -3.196916 -0.037048 0.981467
H  -4.448689 -0.855648 1.974093
H  2.792068 -0.878453 1.757227
H  2.74198 1.565272 -1.874058
H  -4.996609 0.589877 -0.721369
H  -6.220604 -0.220718 0.275246
H  -5.75068 1.41074 2.165594
H  -4.527242 2.218542 1.16436
H  5.070223 2.24704 -1.418605
H  6.324601 1.343268 0.578562
H  -6.718591 3.479847 1.076797
H  -7.550964 2.018708 0.471134
H  -6.32335 2.829765 -0.540477
