program: Gaussian 09
title: 000233329
version: EM64L-G09RevD.01
frameworkgroup: C1[X(C17H17NO3)]
method: RPBEPBE
basis: SDD
operation: Freq
keyword: #p
keyword: freq=noraman
keyword: PBEPBE/SDD
title: #p freq=noraman PBEPBE/SDD
converged: YES YES NO NO
title: Mulliken charges:
elementType: O O O N C C C C C C C C C C C C C C C C C H H H H H H H H H H H H H H H H H
charge: -0.285269 -0.283812 -0.263328 -0.016857 -0.387982 0.571467 0.413933 -0.492210 -0.478689 -0.393935 -0.377353 0.242382 0.172649 -0.329272 -0.357425 -0.359652 0.317583 -0.205767 -0.538589 -0.520589 -0.537715 0.265226 0.254297 0.238736 0.248130 0.253960 0.254922 0.243099 0.253318 0.230714 0.229873 0.244736 0.213376 0.230394 0.259518 0.221201 0.221971 0.246957
chargesum: 0.00000
title: Mulliken charges with hydrogens summed into heavy atoms:
elementType: O O O N C C C C C C C C C C C C C C C C C
charge: -0.285269 -0.283812 -0.263328 -0.016857 -0.122756 0.571467 0.413933 -0.237912 -0.239953 -0.145805 -0.123393 0.242382 0.172649 -0.074350 -0.114326 -0.106334 0.317583 -0.205767 0.166734 0.182699 0.152414
polarizability: 2.50183314e+02 -2.80690957e+00 1.82454024e+02 -1.56261534e+01 7.62174257e+00 1.71687894e+02
1716.lowfreq: -6.7465 -5.5852 -0.0002 0.0006 0.0007 5.7148 14.0443 25.2839 31.0927
frequency: 12.3782 25.2773 31.0243 62.7188 70.5042 91.7867 100.5900 106.4195 117.0544 138.5903 170.9123 183.9205 202.2917 218.2286 222.4109 240.3802 275.6021 277.1985 314.8617 329.9872 341.4352 366.4677 406.8030 414.7156 451.6555 466.7351 475.8226 503.7156 512.9799 541.4735 572.1803 593.8220 629.8459 638.4525 694.9756 721.0914 731.0904 755.8150 764.9597 811.3517 822.6809 828.8107 850.7941 866.3868 917.2314 940.2183 951.2409 956.7951 970.0161 975.0284 988.5195 1000.9150 1004.3339 1111.0673 1112.5809 1113.0629 1113.2193 1118.3501 1142.9686 1155.0647 1157.1532 1159.1740 1183.8604 1188.2101 1204.0846 1224.0033 1235.5188 1256.1787 1259.3242 1278.2314 1309.9831 1373.3982 1383.9325 1408.5304 1417.8588 1427.2812 1437.4281 1446.7127 1456.5868 1467.3076 1467.5984 1472.6446 1473.6677 1481.6232 1498.3860 1501.0381 1582.5372 1586.7483 1609.3105 1623.3612 2190.0005 2959.6900 2966.5687 2967.7926 2977.6797 3047.4632 3057.8650 3087.2316 3126.5287 3127.7722 3129.6610 3130.7349 3132.7165 3137.9423 3154.1024 3162.3006 3168.0278 3169.0546
redmass: 4.6569 3.5775 5.0448 3.6823 3.1955 4.3090 3.4055 3.0032 4.2463 4.4459 1.7071 2.7193 3.0077 2.7764 1.7737 1.9743 1.9842 2.8972 5.2889 4.8197 4.5645 5.8043 5.9802 2.9607 5.7613 3.5270 4.6862 5.3843 2.9169 5.1432 6.1352 5.6493 6.6842 4.5544 3.9933 4.2605 3.7456 4.6478 4.0858 2.0867 1.4488 1.5267 1.8836 1.9791 4.8647 1.3950 1.4176 8.5934 1.3564 4.8766 8.7917 4.0435 2.7566 1.3027 1.7512 1.2605 1.3140 1.3727 1.8120 1.3862 1.4250 1.4279 1.3118 2.5208 1.5193 1.5382 3.2890 1.5851 2.3974 1.8767 1.3038 6.0020 6.4469 2.0946 3.5329 1.2166 1.1745 1.3576 1.0738 1.0494 1.0501 1.0881 1.1064 1.0560 2.4373 2.4327 7.3601 7.7059 6.3367 6.2562 12.5890 1.0331 1.0325 1.0810 1.0346 1.1039 1.1044 1.0972 1.0991 1.1001 1.1047 1.0899 1.0890 1.0893 1.0902 1.0943 1.0951 1.0956
irintensity: 1.3053 0.8575 0.7257 3.7891 0.7521 7.4179 6.6730 3.5652 3.3878 1.6788 2.2797 1.6591 1.1276 4.7633 1.7469 1.3606 0.4844 1.9881 1.8054 1.5144 3.0358 1.7367 5.1092 0.0858 3.6288 4.3644 3.8887 1.8724 13.7043 1.7493 14.7262 16.2624 1.2831 27.6787 22.4788 4.8986 7.1483 4.8724 21.7094 22.3283 28.7016 12.4791 29.5912 25.1446 4.8127 1.1232 1.0696 41.2486 0.3425 5.6929 38.2954 38.5956 16.5092 38.3561 52.5351 0.4303 8.2620 13.6565 18.5788 10.9875 4.0733 6.8548 98.3641 6.1516 26.8099 29.1662 158.3377 55.3472 131.8158 39.4993 1.4579 12.6618 13.0351 32.7329 0.8454 3.9279 13.2917 14.7541 10.0052 13.8000 13.9572 77.4640 67.1293 30.9316 179.3139 84.8500 8.4829 8.9473 19.7606 44.0460 10.9836 64.1335 46.4156 7.2119 91.3999 47.6857 36.4251 36.0003 29.1233 23.2170 18.3248 8.0725 3.7034 4.1178 4.4492 11.8048 6.2858 4.7653
temp: 298.150 k
press: 1.00000 atm
elementType: 8 8 8 7 6 6 6 6 6 6 6 6 6 6 6 6 6 6 6 6 6 1 1 1 1 1 1 1 1 1 1 1 1 1 1 1 1 1
symmnumber: 1
zpe: 782307.6 jmol-1
zpe.correction: 0.297965 hartree
zpe.thermalcorrener: 0.318630 hartree
zpe.thermalcorrenthalpy: 0.319574 hartree
zpe.thermalcorrgfe: 0.246188 hartree
zpe.sumelectzpe: -936.847202 hartree
zpe.sumelectthermal: -936.826538 hartree
zpe.sumelectthermalent: -936.825594 hartree
zpe.sumelectthermalfe: -936.898980 hartree
dipole: -0.4757 -3.9727 -0.4892
dipole: 4.0309
quadrupole: -112.1217 -133.8520 -113.7237
quadrupole: 10.1527 9.9796 -8.9288
quadrupole: 7.7774 -13.9529 6.1754 10.1527 9.9796 -8.9288
hfenergy: -937.1451674 hartree
pointgroup: C01 [X(C17H17N1O3)]
dipole: 0.3113341 -1.509558 0.3732412 debye
polarizability: 249.0437396|6.0685498|181.0329297|-16.5292994|-9.99574|174.2485627 unknown
InChI: InChI=1S/C17H17NO3/c1-19-14-7-4-12(5-8-14)15(11-18)13-6-9-16(20-2)17(10-13)21-3/h4-10,15H,1-3H3
charge 0 multiplicity 1
38 atoms
O  -2.883185 -1.76136 -1.295706
O  -4.23983 -1.732441 1.2119
O  5.346397 -1.087433 -0.237878
N  -0.113365 3.490064 -1.535576
C  0.329987 1.725963 0.42437
C  -0.899026 0.816672 0.60438
C  1.651221 0.948257 0.215229
C  -1.32096 -0.022053 -0.45552
C  -1.599452 0.795386 1.828136
C  1.923811 -0.176409 1.028519
C  2.629217 1.355905 -0.727563
C  -2.434844 -0.875064 -0.303239
C  -3.161259 -0.87934 0.932804
C  -2.723736 -0.046581 1.982526
C  3.139458 -0.885489 0.916103
C  3.844174 0.657475 -0.854855
C  4.106214 -0.464951 -0.031771
C  0.090274 2.702781 -0.662497
C  -2.129165 -1.808079 -2.553567
C  -5.362854 -1.775576 0.250273
C  5.666641 -2.250594 0.593131
H  0.431935 2.321773 1.356001
H  -0.759896 -0.009763 -1.395305
H  -1.284986 1.441296 2.655885
H  1.173489 -0.514695 1.752257
H  2.441939 2.222673 -1.371272
H  -3.288746 -0.076048 2.919073
H  3.316754 -1.75192 1.560166
H  4.602388 0.963588 -1.581799
H  -1.078072 -2.106178 -2.376962
H  -2.158455 -0.832716 -3.075949
H  -2.635378 -2.571965 -3.161546
H  -5.80689 -0.7680 0.134423
H  -6.096259 -2.45651 0.708131
H  -5.031932 -2.157458 -0.728413
H  4.943157 -3.073296 0.43093
H  5.690418 -1.983753 1.667737
H  6.668017 -2.568456 0.268143
