program: Gaussian 09
title: 000233292
version: EM64L-G09RevD.01
frameworkgroup: C1[X(C16H13NO2)]
method: RPBEPBE
basis: SDD
operation: Freq
keyword: #p
keyword: freq=noraman
keyword: PBEPBE/SDD
title: #p freq=noraman PBEPBE/SDD
converged: YES YES NO NO
title: Mulliken charges:
elementType: O O N C C C C C C C C C C C C C C C C H H H H H H H H H H H H H
charge: -0.433279 -0.232799 -0.458887 0.238791 0.200056 0.383874 0.510780 0.108439 -0.340020 -0.391735 -0.373716 -0.379685 -0.421807 -0.267279 -0.273297 -0.266226 -0.280501 0.180831 -0.795764 0.226143 0.268377 0.233889 0.193022 0.336435 0.228379 0.231273 0.232438 0.233705 0.368977 0.235360 0.240665 0.263560
chargesum: 0.00000
title: Mulliken charges with hydrogens summed into heavy atoms:
elementType: O O N C C C C C C C C C C C C C C C C
charge: -0.064302 -0.232799 -0.122452 0.238791 0.200056 0.383874 0.510780 0.108439 -0.340020 -0.165592 -0.105339 -0.145796 -0.228784 -0.038900 -0.042025 -0.033788 -0.046796 0.180831 -0.056179
polarizability: 2.83326674e+02 2.57385341e+01 2.38956210e+02 -9.45173642e+00 5.04186508e+00 8.60615719e+01
1716.lowfreq: -49.8051 -11.1895 -0.0006 -0.0002 0.0005 4.0149 7.4098 43.0414 50.5037
frequency: -49.7979 42.9160 50.4601 68.7016 91.3708 96.9755 134.8374 195.7616 206.2007 236.9014 268.4794 282.2755 291.4550 339.6284 365.0454 408.1009 425.4495 436.9701 447.8676 477.3995 542.5799 553.6794 568.1087 578.2472 613.1902 624.1968 633.2614 661.1036 682.8597 709.2171 728.2953 762.5965 772.5359 786.7710 807.5809 830.8510 859.1182 926.6295 947.4908 953.7041 961.5114 965.5606 983.5426 987.5187 990.8869 1027.9052 1030.2530 1046.5602 1061.2747 1101.4620 1117.1843 1155.9816 1179.1968 1187.3280 1211.0337 1236.4213 1255.9647 1292.8729 1299.1224 1348.4442 1373.3065 1380.5843 1402.5842 1410.0936 1436.9370 1444.0225 1448.8511 1454.9041 1466.5970 1482.3797 1516.3874 1534.6134 1580.9780 1612.1203 1622.1826 1629.5653 1644.5967 2988.7247 3075.0900 3089.3045 3131.5735 3134.5326 3137.0573 3148.0982 3155.8893 3164.8404 3172.8997 3203.2645 3497.4220 3612.0155
redmass: 1.0530 4.6861 3.0947 3.8715 3.8791 3.3399 3.4924 5.3506 1.8394 4.5675 5.0657 4.4160 4.0640 4.9786 4.8203 6.1403 5.9449 3.3568 3.0468 4.8200 3.8355 4.0496 3.1320 3.1487 6.6088 6.0042 1.9326 3.7074 2.6127 4.2662 1.9354 1.8910 1.7434 4.5320 1.5681 4.4447 1.4671 2.1415 2.3389 1.6856 2.7171 1.9078 1.4648 1.3874 5.8986 4.5332 1.6787 1.9788 2.2938 3.1123 2.4710 1.3682 1.0954 1.1072 1.5123 2.5046 1.5970 1.7892 2.3168 2.5281 1.2364 3.6875 7.7693 4.7995 2.0444 2.7157 1.4720 2.4700 1.0482 1.8094 2.5961 3.7203 7.6625 5.8048 6.2954 7.7289 5.1271 1.0379 1.0982 1.0878 1.0855 1.0985 1.0872 1.0916 1.0932 1.0987 1.0965 1.0939 1.0755 1.0657
irintensity: 0.2356 5.1108 13.3936 3.1391 1.7479 3.5912 17.9694 2.4721 72.9175 0.5504 1.2171 0.8085 1.4069 6.0172 4.1051 2.3908 3.1018 13.4478 0.6560 8.2202 1.9632 2.6762 1.8627 4.1831 1.8564 14.7644 45.2835 16.6078 36.9599 5.1060 93.1059 71.5065 32.7180 6.0578 2.1864 28.8417 0.1789 6.0571 25.3391 13.3931 9.2739 15.5610 0.2851 0.5166 2.1271 35.1920 12.4329 4.4078 2.2632 37.8376 15.6793 68.9279 7.4473 0.2487 58.5191 123.4113 71.1620 26.2270 41.1377 54.6246 48.5537 61.2699 25.7585 68.5039 59.0002 4.7381 56.7841 7.7662 16.9418 221.0070 51.9777 11.1749 5.6382 20.1131 16.5436 48.8503 133.0920 9.4388 13.6555 26.5857 1.2775 9.0069 6.4026 24.7332 2.9212 32.3849 36.9607 7.2917 27.9639 39.3249
temp: 298.150 k
press: 1.00000 atm
elementType: 8 8 7 6 6 6 6 6 6 6 6 6 6 6 6 6 6 6 6 1 1 1 1 1 1 1 1 1 1 1 1 1
symmnumber: 1
zpe: 650770.0 jmol-1
zpe.correction: 0.247865 hartree
zpe.thermalcorrener: 0.263222 hartree
zpe.thermalcorrenthalpy: 0.264166 hartree
zpe.thermalcorrgfe: 0.204857 hartree
zpe.sumelectzpe: -821.423285 hartree
zpe.sumelectthermal: -821.407928 hartree
zpe.sumelectthermalent: -821.406984 hartree
zpe.sumelectthermalfe: -821.466294 hartree
dipole: -2.2751 -2.8156 -2.3308
dipole: 4.3053
quadrupole: -96.6112 -89.7659 -119.3852
quadrupole: -3.6341 -10.1790 0.7085
quadrupole: 5.3095 12.1549 -17.4644 -3.6341 -10.1790 0.7085
hfenergy: -821.6711506 hartree
pointgroup: C01 [X(C16H13N1O2)]
dipole: -0.8726517 -1.0519593 -1.0004963 debye
polarizability: 281.3354792|28.1399696|238.6889945|-9.9913613|17.7376266|88.3199822 unknown
InChI: InChI=1S/C16H13NO2/c1-10(18)17-15-13-8-4-2-6-11(13)12-7-3-5-9-14(12)16(15)19/h2-9,17,19H,1H3
charge 0 multiplicity 1
32 atoms
O  0.429397 -2.754801 -0.63368
O  3.49836 0.107868 1.195518
N  2.327226 -0.93327 -0.562115
C  -0.730442 1.290968 0.07836
C  -1.765483 0.25525 0.092028
C  0.64838 0.927683 -0.153334
C  -1.404298 -1.115627 -0.169829
C  0.994399 -0.470542 -0.331964
C  -0.00912 -1.437344 -0.371632
C  -1.044926 2.67369 0.256034
C  1.635828 1.957475 -0.242594
C  -3.14326 0.543423 0.335358
C  -2.419422 -2.12338 -0.195738
C  -0.059302 3.664929 0.184187
C  1.291056 3.302682 -0.079702
C  -4.123746 -0.457297 0.315586
C  -3.760723 -1.805544 0.043271
C  3.465013 -0.700746 0.226713
C  4.674397 -1.534069 -0.203358
H  -2.078902 2.978517 0.440099
H  2.675699 1.685721 -0.424779
H  -3.451677 1.570646 0.547072
H  -2.171877 -3.173875 -0.401755
H  2.373179 -1.762745 -1.16282
H  -0.329188 4.717417 0.322338
H  2.063394 4.075994 -0.149004
H  -5.170728 -0.20168 0.509318
H  -4.525057 -2.589224 0.022384
H  -0.31857 -3.39811 -0.612171
H  4.885951 -1.419149 -1.282004
H  4.500448 -2.607487 -0.000287
H  5.551192 -1.206271 0.3734
