program: Gaussian 09
title: 000233296
version: EM64L-G09RevD.01
frameworkgroup: C1[X(C18H13N3O)]
method: RPBEPBE
basis: SDD
operation: Freq
keyword: #p
keyword: freq=noraman
keyword: PBEPBE/SDD
title: #p freq=noraman PBEPBE/SDD
converged: YES YES NO YES
title: Mulliken charges:
elementType: O N N N C C C C C C C C C C C C C C C C C C H H H H H H H H H H H H H
charge: -0.267616 -0.325619 0.031662 -0.691939 0.334423 0.325296 -0.059527 -0.056750 0.324288 -0.536936 -0.478947 -0.313281 0.560322 -0.285969 -0.446266 -0.342524 -0.342524 0.133891 -0.317677 -0.211763 -0.211761 -0.232534 0.256217 0.276895 0.262752 0.259027 0.228501 0.266337 0.266342 0.253483 0.236197 0.236199 0.235747 0.317347 0.316706
chargesum: 0.00000
title: Mulliken charges with hydrogens summed into heavy atoms:
elementType: O N N N C C C C C C C C C C C C C C C C C C
charge: -0.267616 -0.325619 0.031662 -0.057886 0.334423 0.325296 -0.059527 -0.056750 0.324288 -0.280718 -0.202052 -0.050529 0.560322 -0.026941 -0.217765 -0.076187 -0.076181 0.133891 -0.064195 0.024434 0.024437 0.003214
polarizability: 4.16530830e+02 6.69935481e+00 2.46816730e+02 -1.45740329e-03 -3.19083271e-03 1.21159667e+02
1716.lowfreq: -7.6241 -0.0005 0.0007 0.0008 6.2163 8.8650 39.7607 41.0854 59.8899
frequency: 39.6997 41.0493 59.8898 70.3830 84.3854 158.3597 168.7281 192.7981 217.1649 238.4073 271.3353 309.7349 335.9351 348.6596 402.3617 406.5500 415.5167 427.2810 428.0956 447.6594 464.3341 466.0974 488.7710 527.6844 540.7323 586.2533 600.7194 613.7937 621.2646 624.3151 653.8333 681.2840 700.2868 734.6100 742.8867 765.3518 783.5705 796.0323 816.5649 827.3541 848.0832 856.3146 857.0327 867.4927 873.4081 919.8926 932.7480 959.1785 978.3027 979.9506 983.7254 989.8756 1001.4830 1022.9374 1049.1882 1076.4035 1099.1957 1124.9330 1153.2752 1174.3433 1180.8747 1207.0781 1236.6074 1246.1885 1270.9696 1291.7029 1303.8360 1311.0836 1345.6920 1367.5266 1376.1700 1388.0895 1424.1087 1436.9981 1452.3532 1479.7066 1486.2236 1501.8026 1530.1701 1549.5825 1551.7758 1594.3156 1605.6777 1612.0151 1642.8634 1649.7147 3134.0698 3135.9135 3142.1053 3142.5994 3149.1088 3153.1379 3161.6107 3165.7416 3169.0063 3170.7089 3173.0938 3557.5252 3697.8684
redmass: 3.8872 5.8898 5.4459 5.3680 4.5897 6.0496 5.9223 5.1390 4.8515 4.4063 6.3140 4.8717 4.8223 7.5424 3.7315 2.8017 1.1449 4.4441 2.3123 1.6276 2.7959 7.3718 4.0869 4.9619 4.6519 6.8530 5.9394 6.1031 3.9267 6.4227 3.4407 6.8932 2.0304 3.2377 2.3887 3.1748 6.1507 3.1053 1.5820 1.5492 1.4629 5.6522 1.4934 1.7151 5.4917 2.5967 1.7467 1.3452 2.2928 1.3847 1.2985 5.8594 1.3409 2.1579 1.5665 1.5437 1.5098 1.7099 1.7594 1.0551 1.1352 2.1438 1.6822 2.0131 3.8732 2.2219 2.4788 1.3293 2.7954 4.3747 9.2696 3.9635 7.0458 2.1909 6.3257 2.4118 5.8788 4.5567 6.2665 7.7028 8.0669 6.4937 6.1704 6.4666 1.8750 2.1767 1.0853 1.0892 1.0868 1.0886 1.0910 1.0930 1.0973 1.0959 1.0946 1.0961 1.1018 1.0451 1.1041
irintensity: 0.0297 0.1981 1.0489 0.0663 4.6248 0.2650 4.9740 0.3305 1.4805 1.6707 3.4218 2.8196 3.9346 0.1258 4.1400 0.3657 34.2327 15.2843 94.5626 145.9292 8.5184 34.9609 1.8072 0.0248 0.6281 2.2335 11.6023 0.9413 0.0704 7.1889 11.4149 0.1808 33.9286 0.7215 17.5188 0.6267 12.3847 6.0699 35.1642 13.6341 8.5871 19.9874 42.5469 49.7253 4.0960 5.0554 1.1977 0.2224 3.0591 0.0120 0.0395 2.4997 0.1294 9.9351 2.2715 11.4905 38.2366 50.0421 11.5928 0.0025 1.6940 20.6630 4.9101 10.3165 58.8854 17.8969 27.0074 0.0055 36.6285 143.2361 1.7273 9.5956 50.1269 7.5385 126.3684 46.0663 176.1284 8.8968 74.6502 185.8363 18.4666 3.0461 6.6339 575.5438 14.2794 388.2854 0.1563 13.8363 0.3988 3.7455 11.1538 16.8057 14.2818 21.4791 3.9248 11.1297 12.1204 181.4422 25.0261
temp: 298.150 k
press: 1.00000 atm
elementType: 8 7 7 7 6 6 6 6 6 6 6 6 6 6 6 6 6 6 6 6 6 6 1 1 1 1 1 1 1 1 1 1 1 1 1
symmnumber: 1
zpe: 698877.0 jmol-1
zpe.correction: 0.266188 hartree
zpe.thermalcorrener: 0.283194 hartree
zpe.thermalcorrenthalpy: 0.284139 hartree
zpe.thermalcorrgfe: 0.221182 hartree
zpe.sumelectzpe: -931.711184 hartree
zpe.sumelectthermal: -931.694178 hartree
zpe.sumelectthermalent: -931.693234 hartree
zpe.sumelectthermalfe: -931.756190 hartree
dipole: -10.7708 2.9904 0.0007
dipole: 11.1782
quadrupole: -132.1874 -110.4666 -124.8535
quadrupole: -5.0820 -0.0004 -0.0004
quadrupole: -9.6849 12.0359 -2.3510 -5.0820 -0.0004 -0.0004
hfenergy: -931.9773721 hartree
pointgroup: C01 [X(C18H13N3O1)]
dipole: -4.275412 1.0304816 0.0032345 debye
polarizability: 415.8716815|12.5016605|247.4757456|-0.1975142|0.0017206|121.1598003 unknown
InChI: InChI=1S/C18H13N3O/c19-12-6-8-15-17(10-12)21(13-4-2-1-3-5-13)18-11-14(22)7-9-16(18)20-15/h1-11H,19H2
charge 0 multiplicity 1
35 atoms
O  4.860551 0.252311 -0.003945
N  -0.016566 0.152008 -0.000508
N  0.162764 -2.691736 -0.000858
N  -4.904487 -0.240165 0.002608
C  -1.198224 -0.609581 0.000194
C  1.265445 -0.460691 -0.001427
C  -1.067452 -2.050619 -0.000029
C  1.278188 -1.937201 -0.001513
C  -0.097591 1.604676 -0.000274
C  -2.477784 -0.011817 0.001077
C  2.450487 0.262771 -0.0022
C  -2.255331 -2.838709 0.000647
C  -3.643533 -0.822189 0.001761
C  2.567836 -2.601429 -0.002346
C  -3.520582 -2.253043 0.001527
C  -0.130127 2.301326 1.228349
C  -0.131481 2.301656 -1.228675
C  3.752337 -0.403286 -0.003198
C  3.74247 -1.886175 -0.003102
C  -0.204208 3.712679 1.225538
C  -0.205558 3.71301 -1.225403
C  -0.242628 4.419104 0.000183
H  -2.574442 1.07814 0.001215
H  2.459477 1.356051 -0.002124
H  -2.128504 -3.925401 0.000452
H  2.546312 -3.696052 -0.002312
H  -4.42308 -2.874634 0.002027
H  -0.089139 1.740561 2.167925
H  -0.091522 1.741143 -2.168444
H  4.720782 -2.379717 -0.003705
H  -0.223947 4.257329 2.17546
H  -0.226349 4.257913 -2.175157
H  -0.293465 5.513346 0.000359
H  -5.741794 -0.816235 0.003248
H  -5.016251 0.77016 0.002852
